{"text_format":"1","workbook":"xlsx","n_sheets":4,"sheets":["Information","FundSplits","FundSplitsDB","ActiveFunds"],"not_rendered":{"charts":0,"images":0,"macros":1,"external_links":1,"defined_names":40,"comments":1,"pivot_tables":0},"unopened":[],"bounds":{"document_bytes":16777216,"sheet_cells":100000,"rows_first":2000,"rows_last":500,"rows_between":2000,"halvings":0,"cell_chars":16384,"cell_head_chars":4096},"cells_cut":0,"cells_raw":0,"read":"whole","date_system":"1900"}

{"sheet":"Information","index":0,"n_rows":14,"n_cols":1,"rows_kept":14,"cut":false,"hidden":false,"merged":[]}
[]
["Central Service Fund Splits "]
["Information and Instructions"]
[]
["1.  Fund splits currently on the sheet are the final fund splits from the 2016 Session model"]
["2.  To view a specific agencies splits choose the agency in the drop down box"]
["3.  The top choice in the drop down box will be to view all agencies."]
["4.  You will only be able to update, edit or delete a fund split at the agency level.  If all agencies are chosen it is view only and edits cannot be made."]
["5.  Agencies fund splits begin on row 10.  You will be able to delete or clear any row starting at row 10 and below.  Unlike the previous fund split sheet deleting is allowed"]
["6.  Once you have selected an agency there will be drop down selections that needs to be filled out in columns F, G, H, and I.  These will be smart lists that only apply to the specific agency."]
["7.  Each column starting in column J through column Q will need to have a fund split that equals 100% for the agency.  All columns will need to be filled unlike the previous sheet where blanks were ok.  "]
["    This will simplyfy formulas in the model.  If an agency has only one split for all services then you will just need to copy the split to all columns."]
["8.  Program and Subprogram detail is only needed for certain agencies.  The drop down will display a blank if the agency does not need program/subprogram detail."]
["9.  Once all changes have been made then \"Save/Update\" needs to be clicked.  Changing to a new agency without clicking the button your changes will not be saved."]

{"sheet":"FundSplits","index":1,"n_rows":10,"n_cols":17,"rows_kept":10,"cut":false,"hidden":false,"merged":[]}
[2,{"$f":"LEFT(VLOOKUP(A1,ActiveFunds!$G$4:$H$150,2,0),3)","v":"011"},null,{"$f":"VLOOKUP(A1,ActiveFunds!$G$4:$H$150,2,0)","v":"011-House of Representatives"},null,"Central Service Fund Splits"]
[null,"DuplicateCheck"]
[]
[null,null,null,null,null,null,null,null,{"$f":"IF(AND(LEFT(F10,3)=\"300\",LEFT(G10,3)=\"030\"),$Y$5:$Y$8,IF(AND(LEFT(F10,3)=\"300\",LEFT(G10,3)=\"040\"),$Y$9:$Y$11,\"\"))","v":""}]
[]
[{"$f":"LEFT(F6,3)","v":""},{"$f":"TRIM(LEFT(G6,3))","v":""},{"$f":"TRIM(LEFT(H6,4))","v":""},{"$f":"LEFT(I6,3)","v":""},{"$f":"MID(I6,5,1)","v":""},{"$f":"IF(AgyChoice = 1,\"When all agencies are selected you will not be able to edit the worksheet\",\"\")","v":""},null,{"$f":"IF(AND(LEFT(F10,3)=\"300\",LEFT(G10,3)=\"030\"),ActiveFunds!$Z$5:$Z$8,IF(AND(LEFT(F10,3)=\"300\",LEFT(G104,3)=\"040\"),ActiveFunds!$Z$9:$Z$12,\"\"))","v":""},null,"All Columns by Agency must equal 100%"]
["Agency Code","Program Code","Subprogram Code","Account","AppType","Agency","Program","Subprogram (only used for DSHS in Program 030 and 040)","Account and Approp Title","Auditor","AttGen","OAH","Facilities & Services Only","CTS","Debt Services ","Workers' Comp","All Other Services"]
[null,null,null,null,null,"Percent Totals (only applies when one agency chosen)",null,null,null,{"$f":"IF(AgyChoice=1,\"\",SUM(J9:J982))","v":1},1,1,1,1,1,1,1]
["Agency Code","Program Code","SubprogramCode","Account","AppType","Agency","Program","Subprogram (only used for DSHS in Program 030 and 040)","Account and Approp Title","Auditor","AttGen","OAH","Facilities & Services Only","CTS","Debt Services ","Workers' Comp","All Other Services"]
["011",null,null,"001","1","011-House of Representatives",null,null,"001-1 General Fund-State",1,1,1,1,1,1,1,1]

{"sheet":"FundSplitsDB","index":2,"n_rows":325,"n_cols":20,"rows_kept":325,"cut":false,"hidden":true,"merged":[]}
["Agency Code","Program Code","SubprogramCode","Account","AppType","Agency","Program","Subprogram (only used for DSHS in Program 030 and 040)","Account and Approp Title","Auditor","AttGen","OAH","Facilities & Services Only","CTS","Debt Services ","Workers' Comp","All Other Services",null,"Check Agency has Fund Splits",{"$f":"COUNTIF(A:A,AgyCode)","v":1}]
["011",null,null,"001","1",{"$f":"VLOOKUP(A2,ActiveFunds!$F$4:$H$106,3,0)","v":"011-House of Representatives"},null,null,{"$f":"VLOOKUP(D2&\"-\"&E2,ActiveFunds!$J$4:$K$456,2,0)","v":"001-1 General Fund-State"},1,1,1,1,1,1,1,1]
["012",null,null,"001","1",{"$f":"VLOOKUP(A3,ActiveFunds!$F$4:$H$106,3,0)","v":"012-Senate"},null,null,{"$f":"VLOOKUP(D3&\"-\"&E3,ActiveFunds!$J$4:$K$456,2,0)","v":"001-1 General Fund-State"},1,1,1,1,1,1,1,1]
["013",null,null,"108","1",{"$f":"VLOOKUP(A4,ActiveFunds!$F$4:$H$106,3,0)","v":"013-Joint Transportation Committee"},null,null,{"$f":"VLOOKUP(D4&\"-\"&E4,ActiveFunds!$J$4:$K$456,2,0)","v":"108-1 Motor Vehicle Account-State"},1,1,1,1,1,1,1,1]
["014",null,null,"553","1",{"$f":"VLOOKUP(A5,ActiveFunds!$F$4:$H$106,3,0)","v":"014-Jt Leg Audit & Review Committee"},null,null,{"$f":"VLOOKUP(D5&\"-\"&E5,ActiveFunds!$J$4:$K$456,2,0)","v":"553-1 Performance Audits of Govt Acct-State"},1,1,1,1,1,1,1,1]
["020","","","553","1","020-LEAP Committee",null,null,"553-1 Performance Audits of Govt Acct-State",1,1,1,1,1,1,1,1]
["035",null,null,"600","1",{"$f":"VLOOKUP(A7,ActiveFunds!$F$4:$H$106,3,0)","v":"035-Office of the State Actuary"},null,null,{"$f":"VLOOKUP(D7&\"-\"&E7,ActiveFunds!$J$4:$K$456,2,0)","v":"600-1 Dept of Retirement Systems Expense-State"},1,1,1,1,1,1,1,1]
["037",null,null,"001","1",{"$f":"VLOOKUP(A8,ActiveFunds!$F$4:$H$106,3,0)","v":"037-Office of Legislative Support Svcs"},null,null,{"$f":"VLOOKUP(D8&\"-\"&E8,ActiveFunds!$J$4:$K$456,2,0)","v":"001-1 General Fund-State"},1,1,1,1,1,1,1,1]
["038",null,null,"001","1",{"$f":"VLOOKUP(A9,ActiveFunds!$F$4:$H$106,3,0)","v":"038-Joint Legislative Systems Comm"},null,null,{"$f":"VLOOKUP(D9&\"-\"&E9,ActiveFunds!$J$4:$K$456,2,0)","v":"001-1 General Fund-State"},1,1,1,1,1,1,1,1]
["040",null,null,"001","1",{"$f":"VLOOKUP(A10,ActiveFunds!$F$4:$H$106,3,0)","v":"040-Statute Law Committee"},null,null,{"$f":"VLOOKUP(D10&\"-\"&E10,ActiveFunds!$J$4:$K$456,2,0)","v":"001-1 General Fund-State"},0.8,0.8,0.8,0.8,0.8,0.8,0.8,0.8]
["040",null,null,"197","6",{"$f":"VLOOKUP(A11,ActiveFunds!$F$4:$H$106,3,0)","v":"040-Statute Law Committee"},null,null,{"$f":"VLOOKUP(D11&\"-\"&E11,ActiveFunds!$J$4:$K$456,2,0)","v":"197-6 Statute Law Committee Publications-Non-Appropriated"},0.2,0.2,0.2,0.2,0.2,0.2,0.2,0.2]
["045",null,null,"001","1",{"$f":"VLOOKUP(A12,ActiveFunds!$F$4:$H$106,3,0)","v":"045-Supreme Court"},null,null,{"$f":"VLOOKUP(D12&\"-\"&E12,ActiveFunds!$J$4:$K$456,2,0)","v":"001-1 General Fund-State"},1,1,1,1,1,1,1,1]
["046",null,null,"001","1",{"$f":"VLOOKUP(A13,ActiveFunds!$F$4:$H$106,3,0)","v":"046-State Law Library"},null,null,{"$f":"VLOOKUP(D13&\"-\"&E13,ActiveFunds!$J$4:$K$456,2,0)","v":"001-1 General Fund-State"},1,1,1,1,1,1,1,1]
["048",null,null,"001","1",{"$f":"VLOOKUP(A14,ActiveFunds!$F$4:$H$106,3,0)","v":"048-Court of Appeals"},null,null,{"$f":"VLOOKUP(D14&\"-\"&E14,ActiveFunds!$J$4:$K$456,2,0)","v":"001-1 General Fund-State"},1,1,1,1,1,1,1,1]
["050",null,null,"001","1",{"$f":"VLOOKUP(A15,ActiveFunds!$F$4:$H$106,3,0)","v":"050-Commission on Judicial Conduct"},null,null,{"$f":"VLOOKUP(D15&\"-\"&E15,ActiveFunds!$J$4:$K$456,2,0)","v":"001-1 General Fund-State"},1,1,1,1,1,1,1,1]
["055",null,null,"001","1",{"$f":"VLOOKUP(A16,ActiveFunds!$F$4:$H$106,3,0)","v":"055-Administrative Office of the Courts"},null,null,{"$f":"VLOOKUP(D16&\"-\"&E16,ActiveFunds!$J$4:$K$456,2,0)","v":"001-1 General Fund-State"},1,1,1,1,1,1,1,1]
["056",null,null,"001","1",{"$f":"VLOOKUP(A17,ActiveFunds!$F$4:$H$106,3,0)","v":"056-Office of Public Defense"},null,null,{"$f":"VLOOKUP(D17&\"-\"&E17,ActiveFunds!$J$4:$K$456,2,0)","v":"001-1 General Fund-State"},1,1,1,1,1,1,1,1]
["057",null,null,"001","1",{"$f":"VLOOKUP(A18,ActiveFunds!$F$4:$H$106,3,0)","v":"057-Office of Civil Legal Aid"},null,null,{"$f":"VLOOKUP(D18&\"-\"&E18,ActiveFunds!$J$4:$K$456,2,0)","v":"001-1 General Fund-State"},1,1,1,1,1,1,1,1]
["075",null,null,"001","1",{"$f":"VLOOKUP(A19,ActiveFunds!$F$4:$H$106,3,0)","v":"075-Office of the Governor"},null,null,{"$f":"VLOOKUP(D19&\"-\"&E19,ActiveFunds!$J$4:$K$456,2,0)","v":"001-1 General Fund-State"},1,1,1,1,1,1,1,1]
["080",null,null,"001","1",{"$f":"VLOOKUP(A20,ActiveFunds!$F$4:$H$106,3,0)","v":"080-Office of the Lieutenant Governor"},null,null,{"$f":"VLOOKUP(D20&\"-\"&E20,ActiveFunds!$J$4:$K$456,2,0)","v":"001-1 General Fund-State"},1,1,1,1,1,1,1,1]
{"$rows_left_out":306}
{"sheet":"ActiveFunds","index":3,"n_rows":879,"n_cols":27,"rows_kept":879,"cut":false,"hidden":true,"merged":[]}
[null,null,null,null,null,null,null,"001-2 General Fund-Federal",null,{"$f":"COUNTIF(AgencyFund,Agency)","v":3},null,null,"",{"$f":"IF(pgmcheck=1,OFFSET(AgencyProgram,MATCH((AgyCode),AgencyProgram,0)-1,4,COUNTIF(AgencyProgram,AgyCode)),PgmList)","v":{"$error":"#VALUE!"}},null,null,null,"IF(AgyChoice=1,FundList,OFFSET(AgencyFund,MATCH((Agency),AgencyFund,0)-1,1,COUNTIF(AgencyFund,Agency)))"]
[null,"AgencyFund Table",null,null,null,null,null,null,null,null,"Distinct Fund List",null,null,"Programcheck",null,{"$f":"IFERROR(INDEX($M$4:$M$67,MATCH(AgyCode,Table_clallam_Titles_Entity[Agency],0)),0)","v":0},null,{"$f":"IF(pgmcheck=1,OFFSET(AgencyProgram,MATCH((AgyCode),AgencyProgram,0)-1,4,COUNTIF(AgencyProgram,AgyCode)),OFFSET(pgmcheck,0,1))","v":0},{"$f":"IF(pgmcheck=1,OFFSET(AgencyProgram,MATCH((AgyCode),AgencyProgram,0)-1,4,COUNTIF(AgencyProgram,AgyCode)),PgmList)","v":{"$error":"#VALUE!"}},null,null,null,null,"IF(pgmcheck=1,OFFSET(AgencyProgram,MATCH((AgyCode),AgencyProgram,0)-1,4,COUNTIF(AgencyProgram,AgyCode)),$A$2)"]
[null,"Agency","Fund","Column1",null,null,null,"Agency",null,null,"Fund",null,null,"Agency","ProgramCode","BudgetType","SummFlag","ProgramTitle60","Program2"]
[null,"011-House of Representatives","001-1 General Fund-State",{"$f":"LEFT(Table_clallam_Oversight_ActiveFunds[[#This Row],[Fund]],5)","v":"001-1"},null,"All",1,"All Agencies",{"$f":"LEFT(H4,3)","v":"All"},{"$f":"MID(K4,1,5)","v":"001-1"},"001-1 General Fund-State",null,1,"107","HBE","O",false,"Health Care Auth-Health Benefit Exchange",{"$f":"Table_clallam_Titles_Entity[[#This Row],[ProgramCode]]&\"-\"&Table_clallam_Titles_Entity[[#This Row],[ProgramTitle60]]","v":"HBE-Health Care Auth-Health Benefit Exchange"},null,{"$f":"N4&O4","v":"107HBE"},{"$f":"O4&\"-\"&R4","v":"HBE-Health Care Auth-Health Benefit Exchange"},null,"Agency","Program","Subprogram","AgencyProgram"]
[null,"011-House of Representatives","108-1 Motor Vehicle Account-State",{"$f":"LEFT(Table_clallam_Oversight_ActiveFunds[[#This Row],[Fund]],5)","v":"108-1"},null,"011",2,"011-House of Representatives","011",{"$f":"MID(K5,1,5)","v":"001-2"},"001-2 General Fund-Federal",null,1,"107","OTH","O",false,"Health Care Auth-Other",{"$f":"Table_clallam_Titles_Entity[[#This Row],[ProgramCode]]&\"-\"&Table_clallam_Titles_Entity[[#This Row],[ProgramTitle60]]","v":"OTH-Health Care Auth-Other"},null,{"$f":"N5&O5","v":"107OTH"},{"$f":"O5&\"-\"&R5","v":"OTH-Health Care Auth-Other"},null,"300","030","1000-Community Services/RSN             ","300030"]
[null,"011-House of Representatives","442-6 Legislative Gift Center Account-Non-Appropriated",{"$f":"LEFT(Table_clallam_Oversight_ActiveFunds[[#This Row],[Fund]],5)","v":"442-6"},null,"012",3,"012-Senate","012","001-3","001-3 General Fund-Federal Unanticipated",null,1,"107","PEB","O",false,"Health Care Auth-Employee Benefits",{"$f":"Table_clallam_Titles_Entity[[#This Row],[ProgramCode]]&\"-\"&Table_clallam_Titles_Entity[[#This Row],[ProgramTitle60]]","v":"PEB-Health Care Auth-Employee Benefits"},null,"107PEB","PEB-Health Care Auth-Employee Benefits",null,"300","030","2000-State Facility Services            ","300030"]
[null,"012-Senate","001-1 General Fund-State",{"$f":"LEFT(Table_clallam_Oversight_ActiveFunds[[#This Row],[Fund]],5)","v":"001-1"},null,"013",4,"013-Joint Transportation Committee","013","001-7","001-7 General Fund-Private/Local",null,1,"300","010","O",false,"Children & Family Services",{"$f":"Table_clallam_Titles_Entity[[#This Row],[ProgramCode]]&\"-\"&Table_clallam_Titles_Entity[[#This Row],[ProgramTitle60]]","v":"010-Children & Family Services"},null,"300010","010-Children & Family Services",null,"300","030","8000-Special Projects                   ","300030"]
[null,"012-Senate","108-1 Motor Vehicle Account-State",{"$f":"LEFT(Table_clallam_Oversight_ActiveFunds[[#This Row],[Fund]],5)","v":"108-1"},null,"014",5,"014-Jt Leg Audit & Review Committee","014","001-8","001-8 General Fund-Federal ARRA",null,1,"300","020","O",false,"Juvenile Rehabilitation",{"$f":"Table_clallam_Titles_Entity[[#This Row],[ProgramCode]]&\"-\"&Table_clallam_Titles_Entity[[#This Row],[ProgramTitle60]]","v":"020-Juvenile Rehabilitation"},null,"300020","020-Juvenile Rehabilitation",null,"300","030","9000-Program Support                    ","300030"]
[null,"013-Joint Transportation Committee","108-1 Motor Vehicle Account-State",{"$f":"LEFT(Table_clallam_Oversight_ActiveFunds[[#This Row],[Fund]],5)","v":"108-1"},null,"020",6,"020-LEAP Committee","020","001-9","001-9 General Fund-Private/Local Unanticipated",null,1,"300","030","O",true,"Mental Health",{"$f":"Table_clallam_Titles_Entity[[#This Row],[ProgramCode]]&\"-\"&Table_clallam_Titles_Entity[[#This Row],[ProgramTitle60]]","v":"030-Mental Health"},null,"300030","030-Mental Health",null,"300","040","1000-Community Services                 ","300040"]
[null,"014-Jt Leg Audit & Review Committee","001-1 General Fund-State",{"$f":"LEFT(Table_clallam_Oversight_ActiveFunds[[#This Row],[Fund]],5)","v":"001-1"},null,"035",7,"035-Office of the State Actuary","035","002-1","002-1 Hospital Data Collection Account-State",null,1,"300","040","O",true,"Developmental Disabilities",{"$f":"Table_clallam_Titles_Entity[[#This Row],[ProgramCode]]&\"-\"&Table_clallam_Titles_Entity[[#This Row],[ProgramTitle60]]","v":"040-Developmental Disabilities"},null,"300040","040-Developmental Disabilities",null,"300","040","2000-Residential Habilitation Services  ","300040"]
[null,"014-Jt Leg Audit & Review Committee","553-1 Performance Audits of Govt Acct-State",{"$f":"LEFT(Table_clallam_Oversight_ActiveFunds[[#This Row],[Fund]],5)","v":"553-1"},null,"037",8,"037-Office of Legislative Support Svcs","037","003-1","003-1 Architects' License Account-State",null,1,"300","050","O",false,"Long-Term Care Services",{"$f":"Table_clallam_Titles_Entity[[#This Row],[ProgramCode]]&\"-\"&Table_clallam_Titles_Entity[[#This Row],[ProgramTitle60]]","v":"050-Long-Term Care Services"},null,"300050","050-Long-Term Care Services",null,"300","040","8000-Special Projects                   ","300040"]
[null,"020-LEAP Committee","108-1 Motor Vehicle Account-State",{"$f":"LEFT(Table_clallam_Oversight_ActiveFunds[[#This Row],[Fund]],5)","v":"108-1"},null,"038",9,"038-Joint Legislative Systems Comm","038","006-1","006-1 Public Records Effic/Presrv/Access-State",null,1,"300","060","O",false,"Economic Services Administration",{"$f":"Table_clallam_Titles_Entity[[#This Row],[ProgramCode]]&\"-\"&Table_clallam_Titles_Entity[[#This Row],[ProgramTitle60]]","v":"060-Economic Services Administration"},null,"300060","060-Economic Services Administration",null,"300","040","9000-Program Support                    ","300040"]
[null,"020-LEAP Committee","553-1 Performance Audits of Govt Acct-State",{"$f":"LEFT(Table_clallam_Oversight_ActiveFunds[[#This Row],[Fund]],5)","v":"553-1"},null,"040",10,"040-Statute Law Committee","040","007-1","007-1 Winter Recreation Program Account-State",null,1,"300","070","O",false,"Alcohol & Substance Abuse",{"$f":"Table_clallam_Titles_Entity[[#This Row],[ProgramCode]]&\"-\"&Table_clallam_Titles_Entity[[#This Row],[ProgramTitle60]]","v":"070-Alcohol & Substance Abuse"},null,"300070","070-Alcohol & Substance Abuse"]
[null,"035-Office of the State Actuary","001-1 General Fund-State",{"$f":"LEFT(Table_clallam_Oversight_ActiveFunds[[#This Row],[Fund]],5)","v":"001-1"},null,"045",11,"045-Supreme Court","045","014-1","014-1 Forest Development Account-State",null,1,"300","100","O",false,"Vocational Rehabilitation",{"$f":"Table_clallam_Titles_Entity[[#This Row],[ProgramCode]]&\"-\"&Table_clallam_Titles_Entity[[#This Row],[ProgramTitle60]]","v":"100-Vocational Rehabilitation"},null,"300100","100-Vocational Rehabilitation"]
[null,"035-Office of the State Actuary","418-1 St Health Care Authority Admin Acct-State",{"$f":"LEFT(Table_clallam_Oversight_ActiveFunds[[#This Row],[Fund]],5)","v":"418-1"},null,"046",12,"046-State Law Library","046","01B-1","01B-1 ORV & Non-Highway Vehicle Account-State",null,1,"300","110","O",false,"Administration & Supporting Services",{"$f":"Table_clallam_Titles_Entity[[#This Row],[ProgramCode]]&\"-\"&Table_clallam_Titles_Entity[[#This Row],[ProgramTitle60]]","v":"110-Administration & Supporting Services"},null,"300110","110-Administration & Supporting Services",null,"9000-Program Support                    "]
[null,"035-Office of the State Actuary","600-1 Dept of Retirement Systems Expense-State",{"$f":"LEFT(Table_clallam_Oversight_ActiveFunds[[#This Row],[Fund]],5)","v":"600-1"},null,"048",13,"048-Court of Appeals","048","01F-6","01F-6 Crime Victims Compensation Account-Non-Appropriated",null,1,"300","135","O",false,"Special Commitment Center",{"$f":"Table_clallam_Titles_Entity[[#This Row],[ProgramCode]]&\"-\"&Table_clallam_Titles_Entity[[#This Row],[ProgramTitle60]]","v":"135-Special Commitment Center"},null,"300135","135-Special Commitment Center",null,"2000-State Facility Services            "]
[null,"037-Office of Legislative Support Svcs","001-1 General Fund-State",{"$f":"LEFT(Table_clallam_Oversight_ActiveFunds[[#This Row],[Fund]],5)","v":"001-1"},null,"050",14,"050-Commission on Judicial Conduct","050","01M-1","01M-1 Snowmobile Account-State",null,1,"300","145","O",false,"Payments to Other Agencies",{"$f":"Table_clallam_Titles_Entity[[#This Row],[ProgramCode]]&\"-\"&Table_clallam_Titles_Entity[[#This Row],[ProgramTitle60]]","v":"145-Payments to Other Agencies"},null,"300145","145-Payments to Other Agencies",null,"1000-Community Services/RSN             "]
[null,"037-Office of Legislative Support Svcs","14N-6 Legislative Oral History Account-Non-Appropriated",{"$f":"LEFT(Table_clallam_Oversight_ActiveFunds[[#This Row],[Fund]],5)","v":"14N-6"},null,"055",15,"055-Administrative Office of the Courts","055","024-1","024-1 Professional Engineers' Account-State",null,1,"300","150","O",false,"Information System Services",{"$f":"Table_clallam_Titles_Entity[[#This Row],[ProgramCode]]&\"-\"&Table_clallam_Titles_Entity[[#This Row],[ProgramTitle60]]","v":"150-Information System Services"},null,"300150","150-Information System Services",null,"2000-State Facility Services            "]
[null,"037-Office of Legislative Support Svcs","442-6 Legislative Gift Center Account-Non-Appropriated",{"$f":"LEFT(Table_clallam_Oversight_ActiveFunds[[#This Row],[Fund]],5)","v":"442-6"},null,"056",16,"056-Office of Public Defense","056","025-6","025-6 Pilotage Account-Non-Appropriated",null,1,"300","160","O",false,"Consolidated Field Services",{"$f":"Table_clallam_Titles_Entity[[#This Row],[ProgramCode]]&\"-\"&Table_clallam_Titles_Entity[[#This Row],[ProgramTitle60]]","v":"160-Consolidated Field Services"},null,"300160","160-Consolidated Field Services",null,"9000-Program Support                    "]
[null,"038-Joint Legislative Systems Comm","001-1 General Fund-State",{"$f":"LEFT(Table_clallam_Oversight_ActiveFunds[[#This Row],[Fund]],5)","v":"001-1"},null,"057",17,"057-Office of Civil Legal Aid","057","026-1","026-1 Real Estate Commission Account-State",null,1,"305","010","O",false,"Headquarters",{"$f":"Table_clallam_Titles_Entity[[#This Row],[ProgramCode]]&\"-\"&Table_clallam_Titles_Entity[[#This Row],[ProgramTitle60]]","v":"010-Headquarters"},null,"305010","010-Headquarters"]
{"$rows_left_out":859}