{"text_format":"1","workbook":"xlsx","n_sheets":4,"sheets":["Information","FundSplits","FundSplitsDB","ActiveFunds"],"not_rendered":{"charts":0,"images":0,"macros":1,"external_links":0,"defined_names":87,"comments":1,"pivot_tables":0},"unopened":[],"bounds":{"document_bytes":16777216,"sheet_cells":100000,"rows_first":2000,"rows_last":500,"rows_between":2000,"halvings":0,"cell_chars":16384,"cell_head_chars":4096},"cells_cut":0,"cells_raw":0,"read":"whole","date_system":"1900"}

{"sheet":"Information","index":0,"n_rows":14,"n_cols":3,"rows_kept":14,"cut":false,"hidden":false,"merged":[]}
[]
[null,"2019-21 Central Service Fund Splits "]
[null,"Information and Instructions"]
[]
[1,"Please contact Bryan Way (OFM) if you need help with adding a new fund source, need help, or have questions.","Bryan Way (OFM)"]
["2.      "," This worksheet is dependent on macros, so if you receive a warning at the top of this worksheet, please click “enable.”"]
["3.       ","Select the worksheet titled “FundSplits.”  "]
["4.       ","To update the worksheet for your agency, simply click on the drop box in cell F3, scroll down to your agency number/name, highlight the agency name/number with your mouse, and then click on the that agency name using your left mouse button."]
["5.        ","The worksheet should have now show your agency’s name and, beginning in row 10, the various fund sources used in the 2019-21 budget for CFL.  You will be able to delete or clear any row starting at row 10 and below. "]
["6.       ","To add or edit a new fund source or program, simply click on the handle bar on the right side of the cell you wish to edit.  Please note that only the existing fund sources that apply to your agency are available on these drop downs.  "]
["7.       ","Next you will need to review/update the percentage of that fund source for each of the various central service model fees beginning in columns J through S.  "]
["8.      ","Program and Subprogram detail is only needed for certain agencies.  The drop down will display a blank if the agency does not need program/subprogram detail."]
["9.       ","Once the worksheet looks ok to you and you have made your changes, click on the “Save/Update\" button so that your changes are recorded.  "]
["10.   ","Email your file to your OFM budget analyst and Bryan Way (OFM) with a brief explanation of any changes you made.","OFM budget analyst"]

{"sheet":"FundSplits","index":1,"n_rows":352,"n_cols":36,"rows_kept":352,"cut":false,"hidden":false,"merged":[]}
[31,{"$f":"LEFT(VLOOKUP(A1,ActiveFunds!$G$4:$H$150,2,0),3)","v":"104"},null,{"$f":"VLOOKUP(A1,ActiveFunds!$G$4:$H$150,2,0)","v":"104-Economic & Revenue Forecast Council"},null,"Central Service Fund Splits"]
[null,"DuplicateCheck"]
[]
[null,null,null,null,null,null,null,null,{"$f":"IF(AND(LEFT(F10,3)=\"300\",LEFT(G10,3)=\"030\"),$Y$5:$Y$8,IF(AND(LEFT(F10,3)=\"300\",LEFT(G10,3)=\"040\"),$Y$9:$Y$11,\"\"))","v":""}]
[]
[{"$f":"LEFT(F6,3)","v":""},{"$f":"TRIM(LEFT(G6,3))","v":""},{"$f":"TRIM(LEFT(H6,4))","v":""},{"$f":"LEFT(I6,3)","v":""},{"$f":"MID(I6,5,1)","v":""},{"$f":"IF(AgyChoice = 1,\"When all agencies are selected you will not be able to edit the worksheet\",\"\")","v":""},null,{"$f":"IF(AND(LEFT(F10,3)=\"300\",LEFT(G10,3)=\"030\"),ActiveFunds!$Z$5:$Z$8,IF(AND(LEFT(F10,3)=\"300\",LEFT(G106,3)=\"040\"),ActiveFunds!$Z$9:$Z$12,\"\"))","v":""},null,"All Columns by Agency must equal 100%"]
["Agency Code","Program Code","Subprogram Code","Account","AppType","Agency","Program","Subprogram (only used for DSHS in Program 030 and 040)","Account and Approp Title","Auditor","AttGen","OAH","Facilities & Services Only","CTS","Debt Services ","Workers' Comp","All Other","Risk Mgmt Division","Self Insurance"]
[null,null,null,null,null,"Percent Totals (only applies when one agency chosen)",null,null,null,{"$f":"IF(AgyChoice=1,\"\",SUM(J9:J984))","v":1},1,1,1,1,1,1,1,1,1]
["Agency Code","Program Code","SubprogramCode","Account","AppType","Agency","Program","Subprogram (only used for DSHS in Program 030 and 040)","Account and Approp Title","Auditor","AttGen","OAH","Facilities & Services Only","CTS","Debt Services ","Workers' Comp","All Other","Risk Mgmt Division","Self Insurance"]
["104","","","001","1","104-Economic & Revenue Forecast Council",null,null,"001-1 General Fund-State",1,1,1,1,1,1,1,1,1,1,null,null,0,64.999999999999986,null,null,null,null,null,null,null,null,null,null,null,null,0]
[null,null,null,null,null,null,null,null,null,null,null,null,null,null,null,null,null,null,null,null,null,null,null,null,null,null,null,null,null,null,null,null,null,null,null,0]
[null,null,null,null,null,null,null,null,null,null,null,null,null,null,null,null,null,null,null,null,null,null,null,null,null,null,null,null,null,null,null,null,null,null,null,1]
[null,null,null,null,null,null,null,null,null,null,null,null,null,null,null,null,null,null,null,null,null,null,null,null,null,null,null,null,null,null,null,null,null,null,null,0]
[null,null,null,null,null,null,null,null,null,null,null,null,null,null,null,null,null,null,null,null,null,null,null,null,null,null,null,null,null,null,null,null,null,null,null,0]
[null,null,null,null,null,null,null,null,null,null,null,null,null,null,null,null,null,null,null,null,null,null,null,null,null,null,null,null,null,null,null,null,null,null,null,0]
[null,null,null,null,null,null,null,null,null,null,null,null,null,null,null,null,null,null,null,null,null,null,null,null,null,null,null,null,null,null,null,null,null,null,null,0]
[null,null,null,null,null,null,null,null,null,null,null,null,null,null,null,null,null,null,null,null,null,null,null,null,null,null,null,null,null,null,null,null,null,null,null,0]
[null,null,null,null,null,null,null,null,null,null,null,null,null,null,null,null,null,null,null,null,null,null,null,null,null,null,null,null,null,null,null,null,null,null,null,0]
[null,null,null,null,null,null,null,null,null,null,null,null,null,null,null,null,null,null,null,null,null,null,null,null,null,null,null,null,null,null,null,null,null,null,null,0]
[null,null,null,null,null,null,null,null,null,null,null,null,null,null,null,null,null,null,null,null,null,null,null,null,null,null,null,null,null,null,null,null,null,null,null,0]
[null,null,null,null,null,null,null,null,null,null,null,null,null,null,null,null,null,null,null,null,null,null,null,null,null,null,null,null,null,null,null,null,null,null,null,0]
[null,null,null,null,null,null,null,null,null,null,null,null,null,null,null,null,null,null,null,null,null,null,null,null,null,null,null,null,null,null,null,null,null,null,null,0]
[null,null,null,null,null,null,null,null,null,null,null,null,null,null,null,null,null,null,null,null,null,null,null,null,null,null,null,null,null,null,null,null,null,null,null,0]
[null,null,null,null,null,null,null,null,null,null,null,null,null,null,null,null,null,null,null,null,null,null,null,null,null,null,null,null,null,null,null,null,null,null,null,0]
[null,null,null,null,null,null,null,null,null,null,null,null,null,null,null,null,null,null,null,null,null,null,null,null,null,null,null,null,null,null,null,null,null,null,null,0]
[null,null,null,null,null,null,null,null,null,null,null,null,null,null,null,null,null,null,null,null,null,null,null,null,null,null,null,null,null,null,null,null,null,null,null,0]
[null,null,null,null,null,null,null,null,null,null,null,null,null,null,null,null,null,null,null,null,null,null,null,null,null,null,null,null,null,null,null,null,null,null,null,0]
[null,null,null,null,null,null,null,null,null,null,null,null,null,null,null,null,null,null,null,null,null,null,null,null,null,null,null,null,null,null,null,null,null,null,null,0]
[null,null,null,null,null,null,null,null,null,null,null,null,null,null,null,null,null,null,null,null,null,null,null,null,null,null,null,null,null,null,null,null,null,null,null,0]
[null,null,null,null,null,null,null,null,null,null,null,null,null,null,null,null,null,null,null,null,null,null,null,null,null,null,null,null,null,null,null,null,null,null,null,0]
[null,null,null,null,null,null,null,null,null,null,null,null,null,null,null,null,null,null,null,null,null,null,null,null,null,null,null,null,null,null,null,null,null,null,null,0]
[null,null,null,null,null,null,null,null,null,null,null,null,null,null,null,null,null,null,null,null,null,null,null,null,null,null,null,null,null,null,null,null,null,null,null,0]
[null,null,null,null,null,null,null,null,null,null,null,null,null,null,null,null,null,null,null,null,null,null,null,null,null,null,null,null,null,null,null,null,null,null,null,0]
[null,null,null,null,null,null,null,null,null,null,null,null,null,null,null,null,null,null,null,null,null,null,null,null,null,null,null,null,null,null,null,null,null,null,null,0]
[null,null,null,null,null,null,null,null,null,null,null,null,null,null,null,null,null,null,null,null,null,null,null,null,null,null,null,null,null,null,null,null,null,null,null,0]
[null,null,null,null,null,null,null,null,null,null,null,null,null,null,null,null,null,null,null,null,null,null,null,null,null,null,null,null,null,null,null,null,null,null,null,0]
[null,null,null,null,null,null,null,null,null,null,null,null,null,null,null,null,null,null,null,null,null,null,null,null,null,null,null,null,null,null,null,null,null,null,null,0]
[null,null,null,null,null,null,null,null,null,null,null,null,null,null,null,null,null,null,null,null,null,null,null,null,null,null,null,null,null,null,null,null,null,null,null,{"$error":"#N/A"}]
[null,null,null,null,null,null,null,null,null,null,null,null,null,null,null,null,null,null,null,null,null,null,null,null,null,null,null,null,null,null,null,null,null,null,null,0]
[null,null,null,null,null,null,null,null,null,null,null,null,null,null,null,null,null,null,null,null,null,null,null,null,null,null,null,null,null,null,null,null,null,null,null,0]
[null,null,null,null,null,null,null,null,null,null,null,null,null,null,null,null,null,null,null,null,null,null,null,null,null,null,null,null,null,null,null,null,null,null,null,0]
[null,null,null,null,null,null,null,null,null,null,null,null,null,null,null,null,null,null,null,null,null,null,null,null,null,null,null,null,null,null,null,null,null,null,null,0]
[null,null,null,null,null,null,null,null,null,null,null,null,null,null,null,null,null,null,null,null,null,null,null,null,null,null,null,null,null,null,null,null,null,null,null,0]
[null,null,null,null,null,null,null,null,null,null,null,null,null,null,null,null,null,null,null,null,null,null,null,null,null,null,null,null,null,null,null,null,null,null,null,0]
[null,null,null,null,null,null,null,null,null,null,null,null,null,null,null,null,null,null,null,null,null,null,null,null,null,null,null,null,null,null,null,null,null,null,null,0]
[null,null,null,null,null,null,null,null,null,null,null,null,null,null,null,null,null,null,null,null,null,null,null,null,null,null,null,null,null,null,null,null,null,null,null,0]
[null,null,null,null,null,null,null,null,null,null,null,null,null,null,null,null,null,null,null,null,null,null,null,null,null,null,null,null,null,null,null,null,null,null,null,0]
[null,null,null,null,null,null,null,null,null,null,null,null,null,null,null,null,null,null,null,null,null,null,null,null,null,null,null,null,null,null,null,null,null,null,null,0]
[null,null,null,null,null,null,null,null,null,null,null,null,null,null,null,null,null,null,null,null,null,null,null,null,null,null,null,null,null,null,null,null,null,null,null,0]
[null,null,null,null,null,null,null,null,null,null,null,null,null,null,null,null,null,null,null,null,null,null,null,null,null,null,null,null,null,null,null,null,null,null,null,0]
[null,null,null,null,null,null,null,null,null,null,null,null,null,null,null,null,null,null,null,null,null,null,null,null,null,null,null,null,null,null,null,null,null,null,null,0]
[null,null,null,null,null,null,null,null,null,null,null,null,null,null,null,null,null,null,null,null,null,null,null,null,null,null,null,null,null,null,null,null,null,null,null,0]
[null,null,null,null,null,null,null,null,null,null,null,null,null,null,null,null,null,null,null,null,null,null,null,null,null,null,null,null,null,null,null,null,null,null,null,0]
[null,null,null,null,null,null,null,null,null,null,null,null,null,null,null,null,null,null,null,null,null,null,null,null,null,null,null,null,null,null,null,null,null,null,null,0]
[null,null,null,null,null,null,null,null,null,null,null,null,null,null,null,null,null,null,null,null,null,null,null,null,null,null,null,null,null,null,null,null,null,null,null,0]
[null,null,null,null,null,null,null,null,null,null,null,null,null,null,null,null,null,null,null,null,null,null,null,null,null,null,null,null,null,null,null,null,null,null,null,0]
[null,null,null,null,null,null,null,null,null,null,null,null,null,null,null,null,null,null,null,null,null,null,null,null,null,null,null,null,null,null,null,null,null,null,null,0]
[null,null,null,null,null,null,null,null,null,null,null,null,null,null,null,null,null,null,null,null,null,null,null,null,null,null,null,null,null,null,null,null,null,null,null,0]
[null,null,null,null,null,null,null,null,null,null,null,null,null,null,null,null,null,null,null,null,null,null,null,null,null,null,null,null,null,null,null,null,null,null,null,0]
[null,null,null,null,null,null,null,null,null,null,null,null,null,null,null,null,null,null,null,null,null,null,null,null,null,null,null,null,null,null,null,null,null,null,null,0]
[null,null,null,null,null,null,null,null,null,null,null,null,null,null,null,null,null,null,null,null,null,null,null,null,null,null,null,null,null,null,null,null,null,null,null,0]
[null,null,null,null,null,null,null,null,null,null,null,null,null,null,null,null,null,null,null,null,null,null,null,null,null,null,null,null,null,null,null,null,null,null,null,0]
[null,null,null,null,null,null,null,null,null,null,null,null,null,null,null,null,null,null,null,null,null,null,null,null,null,null,null,null,null,null,null,null,null,null,null,0]
[null,null,null,null,null,null,null,null,null,null,null,null,null,null,null,null,null,null,null,null,null,null,null,null,null,null,null,null,null,null,null,null,null,null,null,0]
[null,null,null,null,null,null,null,null,null,null,null,null,null,null,null,null,null,null,null,null,null,null,null,null,null,null,null,null,null,null,null,null,null,null,null,0]
[null,null,null,null,null,null,null,null,null,null,null,null,null,null,null,null,null,null,null,null,null,null,null,null,null,null,null,null,null,null,null,null,null,null,null,0]
[null,null,null,null,null,null,null,null,null,null,null,null,null,null,null,null,null,null,null,null,null,null,null,null,null,null,null,null,null,null,null,null,null,null,null,{"$error":"#N/A"}]
[null,null,null,null,null,null,null,null,null,null,null,null,null,null,null,null,null,null,null,null,null,null,null,null,null,null,null,null,null,null,null,null,null,null,null,0]
[null,null,null,null,null,null,null,null,null,null,null,null,null,null,null,null,null,null,null,null,null,null,null,null,null,null,null,null,null,null,null,null,null,null,null,0]
[null,null,null,null,null,null,null,null,null,null,null,null,null,null,null,null,null,null,null,null,null,null,null,null,null,null,null,null,null,null,null,null,null,null,null,0]
[null,null,null,null,null,null,null,null,null,null,null,null,null,null,null,null,null,null,null,null,null,null,null,null,null,null,null,null,null,null,null,null,null,null,null,0]
[null,null,null,null,null,null,null,null,null,null,null,null,null,null,null,null,null,null,null,null,null,null,null,null,null,null,null,null,null,null,null,null,null,null,null,0]
[null,null,null,null,null,null,null,null,null,null,null,null,null,null,null,null,null,null,null,null,null,null,null,null,null,null,null,null,null,null,null,null,null,null,null,0]
[null,null,null,null,null,null,null,null,null,null,null,null,null,null,null,null,null,null,null,null,null,null,null,null,null,null,null,null,null,null,null,null,null,null,null,0]
[null,null,null,null,null,null,null,null,null,null,null,null,null,null,null,null,null,null,null,null,null,null,null,null,null,null,null,null,null,null,null,null,null,null,null,0]
[null,null,null,null,null,null,null,null,null,null,null,null,null,null,null,null,null,null,null,null,null,null,null,null,null,null,null,null,null,null,null,null,null,null,null,0]
[null,null,null,null,null,null,null,null,null,null,null,null,null,null,null,null,null,null,null,null,null,null,null,null,null,null,null,null,null,null,null,null,null,null,null,0]
[null,null,null,null,null,null,null,null,null,null,null,null,null,null,null,null,null,null,null,null,null,null,null,null,null,null,null,null,null,null,null,null,null,null,null,0]
[null,null,null,null,null,null,null,null,null,null,null,null,null,null,null,null,null,null,null,null,null,null,null,null,null,null,null,null,null,null,null,null,null,null,null,0]
[null,null,null,null,null,null,null,null,null,null,null,null,null,null,null,null,null,null,null,null,null,null,null,null,null,null,null,null,null,null,null,null,null,null,null,0]
[null,null,null,null,null,null,null,null,null,null,null,null,null,null,null,null,null,null,null,null,null,null,null,null,null,null,null,null,null,null,null,null,null,null,null,0]
[null,null,null,null,null,null,null,null,null,null,null,null,null,null,null,null,null,null,null,null,null,null,null,null,null,null,null,null,null,null,null,null,null,null,null,0]
[null,null,null,null,null,null,null,null,null,null,null,null,null,null,null,null,null,null,null,null,null,null,null,null,null,null,null,null,null,null,null,null,null,null,null,0]
[null,null,null,null,null,null,null,null,null,null,null,null,null,null,null,null,null,null,null,null,null,null,null,null,null,null,null,null,null,null,null,null,null,null,null,0]
[null,null,null,null,null,null,null,null,null,null,null,null,null,null,null,null,null,null,null,null,null,null,null,null,null,null,null,null,null,null,null,null,null,null,null,0]
[null,null,null,null,null,null,null,null,null,null,null,null,null,null,null,null,null,null,null,null,null,null,null,null,null,null,null,null,null,null,null,null,null,null,null,0]
[null,null,null,null,null,null,null,null,null,null,null,null,null,null,null,null,null,null,null,null,null,null,null,null,null,null,null,null,null,null,null,null,null,null,null,0]
[null,null,null,null,null,null,null,null,null,null,null,null,null,null,null,null,null,null,null,null,null,null,null,null,null,null,null,null,null,null,null,null,null,null,null,0]
[null,null,null,null,null,null,null,null,null,null,null,null,null,null,null,null,null,null,null,null,null,null,null,null,null,null,null,null,null,null,null,null,null,null,null,0]
[null,null,null,null,null,null,null,null,null,null,null,null,null,null,null,null,null,null,null,null,null,null,null,null,null,null,null,null,null,null,null,null,null,null,null,0]
[null,null,null,null,null,null,null,null,null,null,null,null,null,null,null,null,null,null,null,null,null,null,null,null,null,null,null,null,null,null,null,null,null,null,null,0]
[null,null,null,null,null,null,null,null,null,null,null,null,null,null,null,null,null,null,null,null,null,null,null,null,null,null,null,null,null,null,null,null,null,null,null,0]
[null,null,null,null,null,null,null,null,null,null,null,null,null,null,null,null,null,null,null,null,null,null,null,null,null,null,null,null,null,null,null,null,null,null,null,{"$error":"#N/A"}]
[null,null,null,null,null,null,null,null,null,null,null,null,null,null,null,null,null,null,null,null,null,null,null,null,null,null,null,null,null,null,null,null,null,null,null,0]
[null,null,null,null,null,null,null,null,null,null,null,null,null,null,null,null,null,null,null,null,null,null,null,null,null,null,null,null,null,null,null,null,null,null,null,0]
[null,null,null,null,null,null,null,null,null,null,null,null,null,null,null,null,null,null,null,null,null,null,null,null,null,null,null,null,null,null,null,null,null,null,null,0]
[null,null,null,null,null,null,null,null,null,null,null,null,null,null,null,null,null,null,null,null,null,null,null,null,null,null,null,null,null,null,null,null,null,null,null,0]
[null,null,null,null,null,null,null,null,null,null,null,null,null,null,null,null,null,null,null,null,null,null,null,null,null,null,null,null,null,null,null,null,null,null,null,0]
[null,null,null,null,null,null,null,null,null,null,null,null,null,null,null,null,null,null,null,null,null,null,null,null,null,null,null,null,null,null,null,null,null,null,null,0]
[null,null,null,null,null,null,null,null,null,null,null,null,null,null,null,null,null,null,null,null,null,null,null,null,null,null,null,null,null,null,null,null,null,null,null,0]
[null,null,null,null,null,null,null,null,null,null,null,null,null,null,null,null,null,null,null,null,null,null,null,null,null,null,null,null,null,null,null,null,null,null,null,0]
[null,null,null,null,null,null,null,null,null,null,null,null,null,null,null,null,null,null,null,null,null,null,null,null,null,null,null,null,null,null,null,null,null,null,null,0]
[null,null,null,null,null,null,null,null,null,null,null,null,null,null,null,null,null,null,null,null,null,null,null,null,null,null,null,null,null,null,null,null,null,null,null,0]
[null,null,null,null,null,null,null,null,null,null,null,null,null,null,null,null,null,null,null,null,null,null,null,null,null,null,null,null,null,null,null,null,null,null,null,0]
[null,null,null,null,null,null,null,null,null,null,null,null,null,null,null,null,null,null,null,null,null,null,null,null,null,null,null,null,null,null,null,null,null,null,null,0]
[null,null,null,null,null,null,null,null,null,null,null,null,null,null,null,null,null,null,null,null,null,null,null,null,null,null,null,null,null,null,null,null,null,null,null,0]
[null,null,null,null,null,null,null,null,null,null,null,null,null,null,null,null,null,null,null,null,null,null,null,null,null,null,null,null,null,null,null,null,null,null,null,0]
[null,null,null,null,null,null,null,null,null,null,null,null,null,null,null,null,null,null,null,null,null,null,null,null,null,null,null,null,null,null,null,null,null,null,null,0]
[null,null,null,null,null,null,null,null,null,null,null,null,null,null,null,null,null,null,null,null,null,null,null,null,null,null,null,null,null,null,null,null,null,null,null,0]
[null,null,null,null,null,null,null,null,null,null,null,null,null,null,null,null,null,null,null,null,null,null,null,null,null,null,null,null,null,null,null,null,null,null,null,0]
[null,null,null,null,null,null,null,null,null,null,null,null,null,null,null,null,null,null,null,null,null,null,null,null,null,null,null,null,null,null,null,null,null,null,null,0]
[null,null,null,null,null,null,null,null,null,null,null,null,null,null,null,null,null,null,null,null,null,null,null,null,null,null,null,null,null,null,null,null,null,null,null,0]
[null,null,null,null,null,null,null,null,null,null,null,null,null,null,null,null,null,null,null,null,null,null,null,null,null,null,null,null,null,null,null,null,null,null,null,0]
[null,null,null,null,null,null,null,null,null,null,null,null,null,null,null,null,null,null,null,null,null,null,null,null,null,null,null,null,null,null,null,null,null,null,null,0]
[null,null,null,null,null,null,null,null,null,null,null,null,null,null,null,null,null,null,null,null,null,null,null,null,null,null,null,null,null,null,null,null,null,null,null,1]
[null,null,null,null,null,null,null,null,null,null,null,null,null,null,null,null,null,null,null,null,null,null,null,null,null,null,null,null,null,null,null,null,null,null,null,0]
[null,null,null,null,null,null,null,null,null,null,null,null,null,null,null,null,null,null,null,null,null,null,null,null,null,null,null,null,null,null,null,null,null,null,null,0]
[null,null,null,null,null,null,null,null,null,null,null,null,null,null,null,null,null,null,null,null,null,null,null,null,null,null,null,null,null,null,null,null,null,null,null,0]
[null,null,null,null,null,null,null,null,null,null,null,null,null,null,null,null,null,null,null,null,null,null,null,null,null,null,null,null,null,null,null,null,null,null,null,0]
[null,null,null,null,null,null,null,null,null,null,null,null,null,null,null,null,null,null,null,null,null,null,null,null,null,null,null,null,null,null,null,null,null,null,null,1]
[null,null,null,null,null,null,null,null,null,null,null,null,null,null,null,null,null,null,null,null,null,null,null,null,null,null,null,null,null,null,null,null,null,null,null,0]
[null,null,null,null,null,null,null,null,null,null,null,null,null,null,null,null,null,null,null,null,null,null,null,null,null,null,null,null,null,null,null,null,null,null,null,0]
[null,null,null,null,null,null,null,null,null,null,null,null,null,null,null,null,null,null,null,null,null,null,null,null,null,null,null,null,null,null,null,null,null,null,null,1]
[null,null,null,null,null,null,null,null,null,null,null,null,null,null,null,null,null,null,null,null,null,null,null,null,null,null,null,null,null,null,null,null,null,null,null,1]
[null,null,null,null,null,null,null,null,null,null,null,null,null,null,null,null,null,null,null,null,null,null,null,null,null,null,null,null,null,null,null,null,null,null,null,0]
[null,null,null,null,null,null,null,null,null,null,null,null,null,null,null,null,null,null,null,null,null,null,null,null,null,null,null,null,null,null,null,null,null,null,null,0]
[null,null,null,null,null,null,null,null,null,null,null,null,null,null,null,null,null,null,null,null,null,null,null,null,null,null,null,null,null,null,null,null,null,null,null,0]
[null,null,null,null,null,null,null,null,null,null,null,null,null,null,null,null,null,null,null,null,null,null,null,null,null,null,null,null,null,null,null,null,null,null,null,0]
[null,null,null,null,null,null,null,null,null,null,null,null,null,null,null,null,null,null,null,null,null,null,null,null,null,null,null,null,null,null,null,null,null,null,null,0]
[null,null,null,null,null,null,null,null,null,null,null,null,null,null,null,null,null,null,null,null,null,null,null,null,null,null,null,null,null,null,null,null,null,null,null,0]
[null,null,null,null,null,null,null,null,null,null,null,null,null,null,null,null,null,null,null,null,null,null,null,null,null,null,null,null,null,null,null,null,null,null,null,0]
[null,null,null,null,null,null,null,null,null,null,null,null,null,null,null,null,null,null,null,null,null,null,null,null,null,null,null,null,null,null,null,null,null,null,null,0]
[null,null,null,null,null,null,null,null,null,null,null,null,null,null,null,null,null,null,null,null,null,null,null,null,null,null,null,null,null,null,null,null,null,null,null,0]
[null,null,null,null,null,null,null,null,null,null,null,null,null,null,null,null,null,null,null,null,null,null,null,null,null,null,null,null,null,null,null,null,null,null,null,0]
[null,null,null,null,null,null,null,null,null,null,null,null,null,null,null,null,null,null,null,null,null,null,null,null,null,null,null,null,null,null,null,null,null,null,null,0]
[null,null,null,null,null,null,null,null,null,null,null,null,null,null,null,null,null,null,null,null,null,null,null,null,null,null,null,null,null,null,null,null,null,null,null,0]
[null,null,null,null,null,null,null,null,null,null,null,null,null,null,null,null,null,null,null,null,null,null,null,null,null,null,null,null,null,null,null,null,null,null,null,0]
[null,null,null,null,null,null,null,null,null,null,null,null,null,null,null,null,null,null,null,null,null,null,null,null,null,null,null,null,null,null,null,null,null,null,null,0]
[null,null,null,null,null,null,null,null,null,null,null,null,null,null,null,null,null,null,null,null,null,null,null,null,null,null,null,null,null,null,null,null,null,null,null,1]
[null,null,null,null,null,null,null,null,null,null,null,null,null,null,null,null,null,null,null,null,null,null,null,null,null,null,null,null,null,null,null,null,null,null,null,1]
[null,null,null,null,null,null,null,null,null,null,null,null,null,null,null,null,null,null,null,null,null,null,null,null,null,null,null,null,null,null,null,null,null,null,null,1]
[null,null,null,null,null,null,null,null,null,null,null,null,null,null,null,null,null,null,null,null,null,null,null,null,null,null,null,null,null,null,null,null,null,null,null,1]
[null,null,null,null,null,null,null,null,null,null,null,null,null,null,null,null,null,null,null,null,null,null,null,null,null,null,null,null,null,null,null,null,null,null,null,0]
[null,null,null,null,null,null,null,null,null,null,null,null,null,null,null,null,null,null,null,null,null,null,null,null,null,null,null,null,null,null,null,null,null,null,null,0]
[null,null,null,null,null,null,null,null,null,null,null,null,null,null,null,null,null,null,null,null,null,null,null,null,null,null,null,null,null,null,null,null,null,null,null,0]
[null,null,null,null,null,null,null,null,null,null,null,null,null,null,null,null,null,null,null,null,null,null,null,null,null,null,null,null,null,null,null,null,null,null,null,1]
[null,null,null,null,null,null,null,null,null,null,null,null,null,null,null,null,null,null,null,null,null,null,null,null,null,null,null,null,null,null,null,null,null,null,null,0]
[null,null,null,null,null,null,null,null,null,null,null,null,null,null,null,null,null,null,null,null,null,null,null,null,null,null,null,null,null,null,null,null,null,null,null,1]
[null,null,null,null,null,null,null,null,null,null,null,null,null,null,null,null,null,null,null,null,null,null,null,null,null,null,null,null,null,null,null,null,null,null,null,0]
[null,null,null,null,null,null,null,null,null,null,null,null,null,null,null,null,null,null,null,null,null,null,null,null,null,null,null,null,null,null,null,null,null,null,null,0]
[null,null,null,null,null,null,null,null,null,null,null,null,null,null,null,null,null,null,null,null,null,null,null,null,null,null,null,null,null,null,null,null,null,null,null,0]
[null,null,null,null,null,null,null,null,null,null,null,null,null,null,null,null,null,null,null,null,null,null,null,null,null,null,null,null,null,null,null,null,null,null,null,0]
[null,null,null,null,null,null,null,null,null,null,null,null,null,null,null,null,null,null,null,null,null,null,null,null,null,null,null,null,null,null,null,null,null,null,null,0]
[null,null,null,null,null,null,null,null,null,null,null,null,null,null,null,null,null,null,null,null,null,null,null,null,null,null,null,null,null,null,null,null,null,null,null,0]
[null,null,null,null,null,null,null,null,null,null,null,null,null,null,null,null,null,null,null,null,null,null,null,null,null,null,null,null,null,null,null,null,null,null,null,0]
[null,null,null,null,null,null,null,null,null,null,null,null,null,null,null,null,null,null,null,null,null,null,null,null,null,null,null,null,null,null,null,null,null,null,null,0]
[null,null,null,null,null,null,null,null,null,null,null,null,null,null,null,null,null,null,null,null,null,null,null,null,null,null,null,null,null,null,null,null,null,null,null,0]
[null,null,null,null,null,null,null,null,null,null,null,null,null,null,null,null,null,null,null,null,null,null,null,null,null,null,null,null,null,null,null,null,null,null,null,0]
[null,null,null,null,null,null,null,null,null,null,null,null,null,null,null,null,null,null,null,null,null,null,null,null,null,null,null,null,null,null,null,null,null,null,null,0]
[null,null,null,null,null,null,null,null,null,null,null,null,null,null,null,null,null,null,null,null,null,null,null,null,null,null,null,null,null,null,null,null,null,null,null,0]
[null,null,null,null,null,null,null,null,null,null,null,null,null,null,null,null,null,null,null,null,null,null,null,null,null,null,null,null,null,null,null,null,null,null,null,0]
[null,null,null,null,null,null,null,null,null,null,null,null,null,null,null,null,null,null,null,null,null,null,null,null,null,null,null,null,null,null,null,null,null,null,null,0]
[null,null,null,null,null,null,null,null,null,null,null,null,null,null,null,null,null,null,null,null,null,null,null,null,null,null,null,null,null,null,null,null,null,null,null,0]
[null,null,null,null,null,null,null,null,null,null,null,null,null,null,null,null,null,null,null,null,null,null,null,null,null,null,null,null,null,null,null,null,null,null,null,0]
[null,null,null,null,null,null,null,null,null,null,null,null,null,null,null,null,null,null,null,null,null,null,null,null,null,null,null,null,null,null,null,null,null,null,null,0]
[null,null,null,null,null,null,null,null,null,null,null,null,null,null,null,null,null,null,null,null,null,null,null,null,null,null,null,null,null,null,null,null,null,null,null,0]
[null,null,null,null,null,null,null,null,null,null,null,null,null,null,null,null,null,null,null,null,null,null,null,null,null,null,null,null,null,null,null,null,null,null,null,0]
[null,null,null,null,null,null,null,null,null,null,null,null,null,null,null,null,null,null,null,null,null,null,null,null,null,null,null,null,null,null,null,null,null,null,null,0]
[null,null,null,null,null,null,null,null,null,null,null,null,null,null,null,null,null,null,null,null,null,null,null,null,null,null,null,null,null,null,null,null,null,null,null,0]
[null,null,null,null,null,null,null,null,null,null,null,null,null,null,null,null,null,null,null,null,null,null,null,null,null,null,null,null,null,null,null,null,null,null,null,0]
[null,null,null,null,null,null,null,null,null,null,null,null,null,null,null,null,null,null,null,null,null,null,null,null,null,null,null,null,null,null,null,null,null,null,null,0]
[null,null,null,null,null,null,null,null,null,null,null,null,null,null,null,null,null,null,null,null,null,null,null,null,null,null,null,null,null,null,null,null,null,null,null,0]
[null,null,null,null,null,null,null,null,null,null,null,null,null,null,null,null,null,null,null,null,null,null,null,null,null,null,null,null,null,null,null,null,null,null,null,0]
[null,null,null,null,null,null,null,null,null,null,null,null,null,null,null,null,null,null,null,null,null,null,null,null,null,null,null,null,null,null,null,null,null,null,null,0]
[null,null,null,null,null,null,null,null,null,null,null,null,null,null,null,null,null,null,null,null,null,null,null,null,null,null,null,null,null,null,null,null,null,null,null,0]
[null,null,null,null,null,null,null,null,null,null,null,null,null,null,null,null,null,null,null,null,null,null,null,null,null,null,null,null,null,null,null,null,null,null,null,0]
[null,null,null,null,null,null,null,null,null,null,null,null,null,null,null,null,null,null,null,null,null,null,null,null,null,null,null,null,null,null,null,null,null,null,null,0]
[null,null,null,null,null,null,null,null,null,null,null,null,null,null,null,null,null,null,null,null,null,null,null,null,null,null,null,null,null,null,null,null,null,null,null,0]
[null,null,null,null,null,null,null,null,null,null,null,null,null,null,null,null,null,null,null,null,null,null,null,null,null,null,null,null,null,null,null,null,null,null,null,0]
[null,null,null,null,null,null,null,null,null,null,null,null,null,null,null,null,null,null,null,null,null,null,null,null,null,null,null,null,null,null,null,null,null,null,null,0]
[null,null,null,null,null,null,null,null,null,null,null,null,null,null,null,null,null,null,null,null,null,null,null,null,null,null,null,null,null,null,null,null,null,null,null,0]
[null,null,null,null,null,null,null,null,null,null,null,null,null,null,null,null,null,null,null,null,null,null,null,null,null,null,null,null,null,null,null,null,null,null,null,0]
[null,null,null,null,null,null,null,null,null,null,null,null,null,null,null,null,null,null,null,null,null,null,null,null,null,null,null,null,null,null,null,null,null,null,null,0]
[null,null,null,null,null,null,null,null,null,null,null,null,null,null,null,null,null,null,null,null,null,null,null,null,null,null,null,null,null,null,null,null,null,null,null,0]
[null,null,null,null,null,null,null,null,null,null,null,null,null,null,null,null,null,null,null,null,null,null,null,null,null,null,null,null,null,null,null,null,null,null,null,0]
[null,null,null,null,null,null,null,null,null,null,null,null,null,null,null,null,null,null,null,null,null,null,null,null,null,null,null,null,null,null,null,null,null,null,null,0]
[null,null,null,null,null,null,null,null,null,null,null,null,null,null,null,null,null,null,null,null,null,null,null,null,null,null,null,null,null,null,null,null,null,null,null,0]
[null,null,null,null,null,null,null,null,null,null,null,null,null,null,null,null,null,null,null,null,null,null,null,null,null,null,null,null,null,null,null,null,null,null,null,0]
[null,null,null,null,null,null,null,null,null,null,null,null,null,null,null,null,null,null,null,null,null,null,null,null,null,null,null,null,null,null,null,null,null,null,null,0]
[null,null,null,null,null,null,null,null,null,null,null,null,null,null,null,null,null,null,null,null,null,null,null,null,null,null,null,null,null,null,null,null,null,null,null,0]
[null,null,null,null,null,null,null,null,null,null,null,null,null,null,null,null,null,null,null,null,null,null,null,null,null,null,null,null,null,null,null,null,null,null,null,0]
[null,null,null,null,null,null,null,null,null,null,null,null,null,null,null,null,null,null,null,null,null,null,null,null,null,null,null,null,null,null,null,null,null,null,null,0]
[null,null,null,null,null,null,null,null,null,null,null,null,null,null,null,null,null,null,null,null,null,null,null,null,null,null,null,null,null,null,null,null,null,null,null,0]
[null,null,null,null,null,null,null,null,null,null,null,null,null,null,null,null,null,null,null,null,null,null,null,null,null,null,null,null,null,null,null,null,null,null,null,0]
[null,null,null,null,null,null,null,null,null,null,null,null,null,null,null,null,null,null,null,null,null,null,null,null,null,null,null,null,null,null,null,null,null,null,null,0]
[null,null,null,null,null,null,null,null,null,null,null,null,null,null,null,null,null,null,null,null,null,null,null,null,null,null,null,null,null,null,null,null,null,null,null,0]
[null,null,null,null,null,null,null,null,null,null,null,null,null,null,null,null,null,null,null,null,null,null,null,null,null,null,null,null,null,null,null,null,null,null,null,0]
[null,null,null,null,null,null,null,null,null,null,null,null,null,null,null,null,null,null,null,null,null,null,null,null,null,null,null,null,null,null,null,null,null,null,null,0]
[null,null,null,null,null,null,null,null,null,null,null,null,null,null,null,null,null,null,null,null,null,null,null,null,null,null,null,null,null,null,null,null,null,null,null,0]
[null,null,null,null,null,null,null,null,null,null,null,null,null,null,null,null,null,null,null,null,null,null,null,null,null,null,null,null,null,null,null,null,null,null,null,0]
[null,null,null,null,null,null,null,null,null,null,null,null,null,null,null,null,null,null,null,null,null,null,null,null,null,null,null,null,null,null,null,null,null,null,null,0]
[null,null,null,null,null,null,null,null,null,null,null,null,null,null,null,null,null,null,null,null,null,null,null,null,null,null,null,null,null,null,null,null,null,null,null,0]
[null,null,null,null,null,null,null,null,null,null,null,null,null,null,null,null,null,null,null,null,null,null,null,null,null,null,null,null,null,null,null,null,null,null,null,0]
[null,null,null,null,null,null,null,null,null,null,null,null,null,null,null,null,null,null,null,null,null,null,null,null,null,null,null,null,null,null,null,null,null,null,null,0]
[null,null,null,null,null,null,null,null,null,null,null,null,null,null,null,null,null,null,null,null,null,null,null,null,null,null,null,null,null,null,null,null,null,null,null,0]
[null,null,null,null,null,null,null,null,null,null,null,null,null,null,null,null,null,null,null,null,null,null,null,null,null,null,null,null,null,null,null,null,null,null,null,0]
[null,null,null,null,null,null,null,null,null,null,null,null,null,null,null,null,null,null,null,null,null,null,null,null,null,null,null,null,null,null,null,null,null,null,null,{"$error":"#N/A"}]
[null,null,null,null,null,null,null,null,null,null,null,null,null,null,null,null,null,null,null,null,null,null,null,null,null,null,null,null,null,null,null,null,null,null,null,{"$error":"#N/A"}]
[null,null,null,null,null,null,null,null,null,null,null,null,null,null,null,null,null,null,null,null,null,null,null,null,null,null,null,null,null,null,null,null,null,null,null,{"$error":"#N/A"}]
[null,null,null,null,null,null,null,null,null,null,null,null,null,null,null,null,null,null,null,null,null,null,null,null,null,null,null,null,null,null,null,null,null,null,null,{"$error":"#N/A"}]
[null,null,null,null,null,null,null,null,null,null,null,null,null,null,null,null,null,null,null,null,null,null,null,null,null,null,null,null,null,null,null,null,null,null,null,0]
[null,null,null,null,null,null,null,null,null,null,null,null,null,null,null,null,null,null,null,null,null,null,null,null,null,null,null,null,null,null,null,null,null,null,null,0]
[null,null,null,null,null,null,null,null,null,null,null,null,null,null,null,null,null,null,null,null,null,null,null,null,null,null,null,null,null,null,null,null,null,null,null,0]
[null,null,null,null,null,null,null,null,null,null,null,null,null,null,null,null,null,null,null,null,null,null,null,null,null,null,null,null,null,null,null,null,null,null,null,0]
[null,null,null,null,null,null,null,null,null,null,null,null,null,null,null,null,null,null,null,null,null,null,null,null,null,null,null,null,null,null,null,null,null,null,null,0]
[null,null,null,null,null,null,null,null,null,null,null,null,null,null,null,null,null,null,null,null,null,null,null,null,null,null,null,null,null,null,null,null,null,null,null,0]
[null,null,null,null,null,null,null,null,null,null,null,null,null,null,null,null,null,null,null,null,null,null,null,null,null,null,null,null,null,null,null,null,null,null,null,0]
[null,null,null,null,null,null,null,null,null,null,null,null,null,null,null,null,null,null,null,null,null,null,null,null,null,null,null,null,null,null,null,null,null,null,null,0]
[null,null,null,null,null,null,null,null,null,null,null,null,null,null,null,null,null,null,null,null,null,null,null,null,null,null,null,null,null,null,null,null,null,null,null,0]
[null,null,null,null,null,null,null,null,null,null,null,null,null,null,null,null,null,null,null,null,null,null,null,null,null,null,null,null,null,null,null,null,null,null,null,0]
[null,null,null,null,null,null,null,null,null,null,null,null,null,null,null,null,null,null,null,null,null,null,null,null,null,null,null,null,null,null,null,null,null,null,null,0]
[null,null,null,null,null,null,null,null,null,null,null,null,null,null,null,null,null,null,null,null,null,null,null,null,null,null,null,null,null,null,null,null,null,null,null,0]
[null,null,null,null,null,null,null,null,null,null,null,null,null,null,null,null,null,null,null,null,null,null,null,null,null,null,null,null,null,null,null,null,null,null,null,0]
[null,null,null,null,null,null,null,null,null,null,null,null,null,null,null,null,null,null,null,null,null,null,null,null,null,null,null,null,null,null,null,null,null,null,null,0]
[null,null,null,null,null,null,null,null,null,null,null,null,null,null,null,null,null,null,null,null,null,null,null,null,null,null,null,null,null,null,null,null,null,null,null,0]
[null,null,null,null,null,null,null,null,null,null,null,null,null,null,null,null,null,null,null,null,null,null,null,null,null,null,null,null,null,null,null,null,null,null,null,0]
[null,null,null,null,null,null,null,null,null,null,null,null,null,null,null,null,null,null,null,null,null,null,null,null,null,null,null,null,null,null,null,null,null,null,null,0]
[null,null,null,null,null,null,null,null,null,null,null,null,null,null,null,null,null,null,null,null,null,null,null,null,null,null,null,null,null,null,null,null,null,null,null,0]
[null,null,null,null,null,null,null,null,null,null,null,null,null,null,null,null,null,null,null,null,null,null,null,null,null,null,null,null,null,null,null,null,null,null,null,0]
[null,null,null,null,null,null,null,null,null,null,null,null,null,null,null,null,null,null,null,null,null,null,null,null,null,null,null,null,null,null,null,null,null,null,null,0]
[null,null,null,null,null,null,null,null,null,null,null,null,null,null,null,null,null,null,null,null,null,null,null,null,null,null,null,null,null,null,null,null,null,null,null,0]
[null,null,null,null,null,null,null,null,null,null,null,null,null,null,null,null,null,null,null,null,null,null,null,null,null,null,null,null,null,null,null,null,null,null,null,0]
[null,null,null,null,null,null,null,null,null,null,null,null,null,null,null,null,null,null,null,null,null,null,null,null,null,null,null,null,null,null,null,null,null,null,null,0]
[null,null,null,null,null,null,null,null,null,null,null,null,null,null,null,null,null,null,null,null,null,null,null,null,null,null,null,null,null,null,null,null,null,null,null,0]
[null,null,null,null,null,null,null,null,null,null,null,null,null,null,null,null,null,null,null,null,null,null,null,null,null,null,null,null,null,null,null,null,null,null,null,0]
[null,null,null,null,null,null,null,null,null,null,null,null,null,null,null,null,null,null,null,null,null,null,null,null,null,null,null,null,null,null,null,null,null,null,null,0]
[null,null,null,null,null,null,null,null,null,null,null,null,null,null,null,null,null,null,null,null,null,null,null,null,null,null,null,null,null,null,null,null,null,null,null,0]
[null,null,null,null,null,null,null,null,null,null,null,null,null,null,null,null,null,null,null,null,null,null,null,null,null,null,null,null,null,null,null,null,null,null,null,0]
[null,null,null,null,null,null,null,null,null,null,null,null,null,null,null,null,null,null,null,null,null,null,null,null,null,null,null,null,null,null,null,null,null,null,null,0]
[null,null,null,null,null,null,null,null,null,null,null,null,null,null,null,null,null,null,null,null,null,null,null,null,null,null,null,null,null,null,null,null,null,null,null,0]
[null,null,null,null,null,null,null,null,null,null,null,null,null,null,null,null,null,null,null,null,null,null,null,null,null,null,null,null,null,null,null,null,null,null,null,0]
[null,null,null,null,null,null,null,null,null,null,null,null,null,null,null,null,null,null,null,null,null,null,null,null,null,null,null,null,null,null,null,null,null,null,null,0]
[null,null,null,null,null,null,null,null,null,null,null,null,null,null,null,null,null,null,null,null,null,null,null,null,null,null,null,null,null,null,null,null,null,null,null,0]
[null,null,null,null,null,null,null,null,null,null,null,null,null,null,null,null,null,null,null,null,null,null,null,null,null,null,null,null,null,null,null,null,null,null,null,0]
[null,null,null,null,null,null,null,null,null,null,null,null,null,null,null,null,null,null,null,null,null,null,null,null,null,null,null,null,null,null,null,null,null,null,null,0]
[null,null,null,null,null,null,null,null,null,null,null,null,null,null,null,null,null,null,null,null,null,null,null,null,null,null,null,null,null,null,null,null,null,null,null,0]
[null,null,null,null,null,null,null,null,null,null,null,null,null,null,null,null,null,null,null,null,null,null,null,null,null,null,null,null,null,null,null,null,null,null,null,0]
[null,null,null,null,null,null,null,null,null,null,null,null,null,null,null,null,null,null,null,null,null,null,null,null,null,null,null,null,null,null,null,null,null,null,null,0]
[null,null,null,null,null,null,null,null,null,null,null,null,null,null,null,null,null,null,null,null,null,null,null,null,null,null,null,null,null,null,null,null,null,null,null,0]
[null,null,null,null,null,null,null,null,null,null,null,null,null,null,null,null,null,null,null,null,null,null,null,null,null,null,null,null,null,null,null,null,null,null,null,0]
[null,null,null,null,null,null,null,null,null,null,null,null,null,null,null,null,null,null,null,null,null,null,null,null,null,null,null,null,null,null,null,null,null,null,null,0]
[null,null,null,null,null,null,null,null,null,null,null,null,null,null,null,null,null,null,null,null,null,null,null,null,null,null,null,null,null,null,null,null,null,null,null,0]
[null,null,null,null,null,null,null,null,null,null,null,null,null,null,null,null,null,null,null,null,null,null,null,null,null,null,null,null,null,null,null,null,null,null,null,0]
[null,null,null,null,null,null,null,null,null,null,null,null,null,null,null,null,null,null,null,null,null,null,null,null,null,null,null,null,null,null,null,null,null,null,null,0]
[null,null,null,null,null,null,null,null,null,null,null,null,null,null,null,null,null,null,null,null,null,null,null,null,null,null,null,null,null,null,null,null,null,null,null,0]
[null,null,null,null,null,null,null,null,null,null,null,null,null,null,null,null,null,null,null,null,null,null,null,null,null,null,null,null,null,null,null,null,null,null,null,1]
[null,null,null,null,null,null,null,null,null,null,null,null,null,null,null,null,null,null,null,null,null,null,null,null,null,null,null,null,null,null,null,null,null,null,null,1]
[null,null,null,null,null,null,null,null,null,null,null,null,null,null,null,null,null,null,null,null,null,null,null,null,null,null,null,null,null,null,null,null,null,null,null,1]
[null,null,null,null,null,null,null,null,null,null,null,null,null,null,null,null,null,null,null,null,null,null,null,null,null,null,null,null,null,null,null,null,null,null,null,1]
[null,null,null,null,null,null,null,null,null,null,null,null,null,null,null,null,null,null,null,null,null,null,null,null,null,null,null,null,null,null,null,null,null,null,null,1]
[null,null,null,null,null,null,null,null,null,null,null,null,null,null,null,null,null,null,null,null,null,null,null,null,null,null,null,null,null,null,null,null,null,null,null,1]
[null,null,null,null,null,null,null,null,null,null,null,null,null,null,null,null,null,null,null,null,null,null,null,null,null,null,null,null,null,null,null,null,null,null,null,1]
[null,null,null,null,null,null,null,null,null,null,null,null,null,null,null,null,null,null,null,null,null,null,null,null,null,null,null,null,null,null,null,null,null,null,null,1]
[null,null,null,null,null,null,null,null,null,null,null,null,null,null,null,null,null,null,null,null,null,null,null,null,null,null,null,null,null,null,null,null,null,null,null,1]
[null,null,null,null,null,null,null,null,null,null,null,null,null,null,null,null,null,null,null,null,null,null,null,null,null,null,null,null,null,null,null,null,null,null,null,1]
[null,null,null,null,null,null,null,null,null,null,null,null,null,null,null,null,null,null,null,null,null,null,null,null,null,null,null,null,null,null,null,null,null,null,null,1]
[null,null,null,null,null,null,null,null,null,null,null,null,null,null,null,null,null,null,null,null,null,null,null,null,null,null,null,null,null,null,null,null,null,null,null,1]
[null,null,null,null,null,null,null,null,null,null,null,null,null,null,null,null,null,null,null,null,null,null,null,null,null,null,null,null,null,null,null,null,null,null,null,1]
[null,null,null,null,null,null,null,null,null,null,null,null,null,null,null,null,null,null,null,null,null,null,null,null,null,null,null,null,null,null,null,null,null,null,null,1]
[null,null,null,null,null,null,null,null,null,null,null,null,null,null,null,null,null,null,null,null,null,null,null,null,null,null,null,null,null,null,null,null,null,null,null,1]
[null,null,null,null,null,null,null,null,null,null,null,null,null,null,null,null,null,null,null,null,null,null,null,null,null,null,null,null,null,null,null,null,null,null,null,1]
[null,null,null,null,null,null,null,null,null,null,null,null,null,null,null,null,null,null,null,null,null,null,null,null,null,null,null,null,null,null,null,null,null,null,null,1]
[null,null,null,null,null,null,null,null,null,null,null,null,null,null,null,null,null,null,null,null,null,null,null,null,null,null,null,null,null,null,null,null,null,null,null,1]
[null,null,null,null,null,null,null,null,null,null,null,null,null,null,null,null,null,null,null,null,null,null,null,null,null,null,null,null,null,null,null,null,null,null,null,1]
[null,null,null,null,null,null,null,null,null,null,null,null,null,null,null,null,null,null,null,null,null,null,null,null,null,null,null,null,null,null,null,null,null,null,null,1]
[null,null,null,null,null,null,null,null,null,null,null,null,null,null,null,null,null,null,null,null,null,null,null,null,null,null,null,null,null,null,null,null,null,null,null,1]
[null,null,null,null,null,null,null,null,null,null,null,null,null,null,null,null,null,null,null,null,null,null,null,null,null,null,null,null,null,null,null,null,null,null,null,1]
[null,null,null,null,null,null,null,null,null,null,null,null,null,null,null,null,null,null,null,null,null,null,null,null,null,null,null,null,null,null,null,null,null,null,null,1]
[null,null,null,null,null,null,null,null,null,null,null,null,null,null,null,null,null,null,null,null,null,null,null,null,null,null,null,null,null,null,null,null,null,null,null,1]
[null,null,null,null,null,null,null,null,null,null,null,null,null,null,null,null,null,null,null,null,null,null,null,null,null,null,null,null,null,null,null,null,null,null,null,1]
[null,null,null,null,null,null,null,null,null,null,null,null,null,null,null,null,null,null,null,null,null,null,null,null,null,null,null,null,null,null,null,null,null,null,null,1]
[null,null,null,null,null,null,null,null,null,null,null,null,null,null,null,null,null,null,null,null,null,null,null,null,null,null,null,null,null,null,null,null,null,null,null,1]
[null,null,null,null,null,null,null,null,null,null,null,null,null,null,null,null,null,null,null,null,null,null,null,null,null,null,null,null,null,null,null,null,null,null,null,1]
[null,null,null,null,null,null,null,null,null,null,null,null,null,null,null,null,null,null,null,null,null,null,null,null,null,null,null,null,null,null,null,null,null,null,null,0]
[null,null,null,null,null,null,null,null,null,null,null,null,null,null,null,null,null,null,null,null,null,null,null,null,null,null,null,null,null,null,null,null,null,null,null,0]
[null,null,null,null,null,null,null,null,null,null,null,null,null,null,null,null,null,null,null,null,null,null,null,null,null,null,null,null,null,null,null,null,null,null,null,0]
[null,null,null,null,null,null,null,null,null,null,null,null,null,null,null,null,null,null,null,null,null,null,null,null,null,null,null,null,null,null,null,null,null,null,null,0]
[null,null,null,null,null,null,null,null,null,null,null,null,null,null,null,null,null,null,null,null,null,null,null,null,null,null,null,null,null,null,null,null,null,null,null,0]
[null,null,null,null,null,null,null,null,null,null,null,null,null,null,null,null,null,null,null,null,null,null,null,null,null,null,null,null,null,null,null,null,null,null,null,0]
[null,null,null,null,null,null,null,null,null,null,null,null,null,null,null,null,null,null,null,null,null,null,null,null,null,null,null,null,null,null,null,null,null,null,null,0]
[null,null,null,null,null,null,null,null,null,null,null,null,null,null,null,null,null,null,null,null,null,null,null,null,null,null,null,null,null,null,null,null,null,null,null,0]
[null,null,null,null,null,null,null,null,null,null,null,null,null,null,null,null,null,null,null,null,null,null,null,null,null,null,null,null,null,null,null,null,null,null,null,0]
[null,null,null,null,null,null,null,null,null,null,null,null,null,null,null,null,null,null,null,null,null,null,null,null,null,null,null,null,null,null,null,null,null,null,null,0]
[null,null,null,null,null,null,null,null,null,null,null,null,null,null,null,null,null,null,null,null,null,null,null,null,null,null,null,null,null,null,null,null,null,null,null,0]
[null,null,null,null,null,null,null,null,null,null,null,null,null,null,null,null,null,null,null,null,null,null,null,null,null,null,null,null,null,null,null,null,null,null,null,0]
[null,null,null,null,null,null,null,null,null,null,null,null,null,null,null,null,null,null,null,null,null,null,null,null,null,null,null,null,null,null,null,null,null,null,null,0]
[null,null,null,null,null,null,null,null,null,null,null,null,null,null,null,null,null,null,null,null,null,null,null,null,null,null,null,null,null,null,null,null,null,null,null,0]
[null,null,null,null,null,null,null,null,null,null,null,null,null,null,null,null,null,null,null,null,null,null,null,null,null,null,null,null,null,null,null,null,null,null,null,0]
[null,null,null,null,null,null,null,null,null,null,null,null,null,null,null,null,null,null,null,null,null,null,null,null,null,null,null,null,null,null,null,null,null,null,null,0]
[null,null,null,null,null,null,null,null,null,null,null,null,null,null,null,null,null,null,null,null,null,null,null,null,null,null,null,null,null,null,null,null,null,null,null,0]
[null,null,null,null,null,null,null,null,null,null,null,null,null,null,null,null,null,null,null,null,null,null,null,null,null,null,null,null,null,null,null,null,null,null,null,0]
[null,null,null,null,null,null,null,null,null,null,null,null,null,null,null,null,null,null,null,null,null,null,null,null,null,null,null,null,null,null,null,null,null,null,null,0]
[null,null,null,null,null,null,null,null,null,null,null,null,null,null,null,null,null,null,null,null,null,null,null,null,null,null,null,null,null,null,null,null,null,null,null,0]
[null,null,null,null,null,null,null,null,null,null,null,null,null,null,null,null,null,null,null,null,null,null,null,null,null,null,null,null,null,null,null,null,null,null,null,0]
[null,null,null,null,null,null,null,null,null,null,null,null,null,null,null,null,null,null,null,null,null,null,null,null,null,null,null,null,null,null,null,null,null,null,null,0]
[null,null,null,null,null,null,null,null,null,null,null,null,null,null,null,null,null,null,null,null,null,null,null,null,null,null,null,null,null,null,null,null,null,null,null,0]
[null,null,null,null,null,null,null,null,null,null,null,null,null,null,null,null,null,null,null,null,null,null,null,null,null,null,null,null,null,null,null,null,null,null,null,0]
[null,null,null,null,null,null,null,null,null,null,null,null,null,null,null,null,null,null,null,null,null,null,null,null,null,null,null,null,null,null,null,null,null,null,null,0]
[null,null,null,null,null,null,null,null,null,null,null,null,null,null,null,null,null,null,null,null,null,null,null,null,null,null,null,null,null,null,null,null,null,null,null,0]
[null,null,null,null,null,null,null,null,null,null,null,null,null,null,null,null,null,null,null,null,null,null,null,null,null,null,null,null,null,null,null,null,null,null,null,0]
[null,null,null,null,null,null,null,null,null,null,null,null,null,null,null,null,null,null,null,null,null,null,null,null,null,null,null,null,null,null,null,null,null,null,null,0]
[null,null,null,null,null,null,null,null,null,null,null,null,null,null,null,null,null,null,null,null,null,null,null,null,null,null,null,null,null,null,null,null,null,null,null,0]
[null,null,null,null,null,null,null,null,null,null,null,null,null,null,null,null,null,null,null,null,null,null,null,null,null,null,null,null,null,null,null,null,null,null,null,0]
[null,null,null,null,null,null,null,null,null,null,null,null,null,null,null,null,null,null,null,null,null,null,null,null,null,null,null,null,null,null,null,null,null,null,null,0]
[null,null,null,null,null,null,null,null,null,null,null,null,null,null,null,null,null,null,null,null,null,null,null,null,null,null,null,null,null,null,null,null,null,null,null,0]
[null,null,null,null,null,null,null,null,null,null,null,null,null,null,null,null,null,null,null,null,null,null,null,null,null,null,null,null,null,null,null,null,null,null,null,0]
[]
[]
[]
[]
[]
[]
[]
[]
[]
[]
[]
[]
[]
[]
[]
[]
[]
[]
[]
[]
[]
[]
[]
[]
[]
[]
[]
[]
[]
[]
[null,null,null,null,null,null,null,null,null,null,null,null,null,null,null,null,null,null,null,null,null,null,null,null,null,null,null,null,null,null,null,{"$error":"#REF!"}]
[]
[]
[null,null,null,null,null,null,null,null,null,null,null,null,null,null,null,null,null,null,null,null,null,null,null,null,null,null,null,null,null,null,null,null,null,null,null,1]
[null,null,null,null,null,null,null,null,null,null,null,null,null,null,null,null,null,null,null,null,null,null,null,null,null,null,null,null,null,null,null,null,null,null,null,1]
[null,null,null,null,null,null,null,null,null,null,null,null,null,null,null,null,null,null,null,null,null,null,null,null,null,null,null,null,null,null,null,null,null,null,null,1]

{"sheet":"FundSplitsDB","index":2,"n_rows":341,"n_cols":36,"rows_kept":341,"cut":false,"hidden":true,"merged":[]}
["Agency Code","Program Code","SubprogramCode","Account","AppType","Agency","Program","Subprogram (only used for DSHS in Program 030 and 040)","Account and Approp Title",{"$f":"IF(FundSplits!J7=\"\",\"\",FundSplits!J7)","v":"Auditor"},{"$f":"IF(FundSplits!K7=\"\",\"\",FundSplits!K7)","v":"AttGen"},{"$f":"IF(FundSplits!L7=\"\",\"\",FundSplits!L7)","v":"OAH"},{"$f":"IF(FundSplits!M7=\"\",\"\",FundSplits!M7)","v":"Facilities & Services Only"},{"$f":"IF(FundSplits!N7=\"\",\"\",FundSplits!N7)","v":"CTS"},{"$f":"IF(FundSplits!O7=\"\",\"\",FundSplits!O7)","v":"Debt Services "},{"$f":"IF(FundSplits!P7=\"\",\"\",FundSplits!P7)","v":"Workers' Comp"},{"$f":"IF(FundSplits!Q7=\"\",\"\",FundSplits!Q7)","v":"All Other"},"Risk Mgmt Division","Self Insurance",{"$f":"IF(FundSplits!T7=\"\",\"\",FundSplits!T7)","v":""},{"$f":"IF(FundSplits!U7=\"\",\"\",FundSplits!U7)","v":""},{"$f":"IF(FundSplits!V7=\"\",\"\",FundSplits!V7)","v":""},{"$f":"IF(FundSplits!W7=\"\",\"\",FundSplits!W7)","v":""},{"$f":"IF(FundSplits!X7=\"\",\"\",FundSplits!X7)","v":""},{"$f":"IF(FundSplits!Y7=\"\",\"\",FundSplits!Y7)","v":""},{"$f":"IF(FundSplits!Z7=\"\",\"\",FundSplits!Z7)","v":""},{"$f":"IF(FundSplits!AA7=\"\",\"\",FundSplits!AA7)","v":""},{"$f":"IF(FundSplits!AB7=\"\",\"\",FundSplits!AB7)","v":""},{"$f":"IF(FundSplits!AC7=\"\",\"\",FundSplits!AC7)","v":""},{"$f":"IF(FundSplits!AD7=\"\",\"\",FundSplits!AD7)","v":""},{"$f":"IF(FundSplits!AE7=\"\",\"\",FundSplits!AE7)","v":""},null,"Check Agency has Fund Splits",{"$f":"COUNTIF(A:A,AgyCode)","v":1}]
[{"$f":"LEFT(F2,3)","v":"011"},{"$f":"IF(G2=\"\",\"\",LEFT(G2,3))","v":""},{"$f":"IF(H2=\"\",\"\",LEFT(H2,4))","v":""},{"$f":"LEFT(I2,3)","v":"001"},{"$f":"MID(I2,5,1)","v":"1"},"011-House of Representatives",null,null,"001-1 General Fund-State",1,1,1,1,1,1,1,1,1,1,null,null,{"$f":"SUMPRODUCT(--(FundSplits!$D$2:$D$335=\"001\"),--(FundSplits!$E$2:$E$335=\"1\"),FundSplits!$J$2:$J$335)","v":1},{"$f":"SUM(J2:J198)","v":64.999999999999986},null,null,null,null,null,null,null,null,null,null,null,null,{"$f":"VLOOKUP(A2&D2&\"-\"&E2,ActiveFunds!$AH$4:$AI$787,2,0)","v":0}]
["012","","","001","1","012-Senate",null,null,"001-1 General Fund-State",1,1,1,1,1,1,1,1,1,1,null,null,null,null,null,null,null,null,null,null,null,null,null,null,null,null,{"$f":"VLOOKUP(A3&D3&\"-\"&E3,ActiveFunds!$AH$4:$AI$787,2,0)","v":0}]
["013","","","108","1","013-Joint Transportation Committee",null,null,"108-1 Motor Vehicle Account-State",1,1,1,1,1,1,1,1,1,1,null,null,null,null,null,null,null,null,null,null,null,null,null,null,null,null,{"$f":"VLOOKUP(A4&D4&\"-\"&E4,ActiveFunds!$AH$4:$AI$787,2,0)","v":1}]
["014","","","553","1","014-Jt Leg Audit & Review Committee",null,null,"553-1 Performance Audits of Govt Acct-State",1,1,1,1,1,1,1,1,1,1,null,null,null,null,null,null,null,null,null,null,null,null,null,null,null,null,{"$f":"VLOOKUP(A5&D5&\"-\"&E5,ActiveFunds!$AH$4:$AI$787,2,0)","v":0}]
["020","","","553","1","020-LEAP Committee",null,null,"553-1 Performance Audits of Govt Acct-State",1,1,1,1,1,1,1,1,1,1,null,null,null,null,null,null,null,null,null,null,null,null,null,null,null,null,{"$f":"VLOOKUP(A6&D6&\"-\"&E6,ActiveFunds!$AH$4:$AI$787,2,0)","v":0}]
["035","","","600","1","035-Office of the State Actuary",null,null,"600-1 Dept of Retirement Systems Expense-State",1,1,1,1,1,1,1,1,1,1,null,null,null,null,null,null,null,null,null,null,null,null,null,null,null,null,{"$f":"VLOOKUP(A7&D7&\"-\"&E7,ActiveFunds!$AH$4:$AI$787,2,0)","v":0}]
["037","","","001","1","037-Office of Legislative Support Svcs",null,null,"001-1 General Fund-State",1,1,1,1,1,1,1,1,1,1,null,null,null,null,null,null,null,null,null,null,null,null,null,null,null,null,{"$f":"VLOOKUP(A8&D8&\"-\"&E8,ActiveFunds!$AH$4:$AI$787,2,0)","v":0}]
["038","","","001","1","038-Joint Legislative Systems Comm",null,null,"001-1 General Fund-State",1,1,1,1,1,1,1,1,1,1,null,null,null,null,null,null,null,null,null,null,null,null,null,null,null,null,{"$f":"VLOOKUP(A9&D9&\"-\"&E9,ActiveFunds!$AH$4:$AI$787,2,0)","v":0}]
["040","","","001","1","040-Statute Law Committee",null,null,"001-1 General Fund-State",0.8,0.8,0.8,0.8,0.8,0.8,0.8,0.8,0.8,0.8,null,null,null,null,null,null,null,null,null,null,null,null,null,null,null,null,{"$f":"VLOOKUP(A10&D10&\"-\"&E10,ActiveFunds!$AH$4:$AI$787,2,0)","v":0}]
["040","","","197","6","040-Statute Law Committee",null,null,"197-6 Statute Law Committee Publications-Non-Appropriated",0.2,0.2,0.2,0.2,0.2,0.2,0.2,0.2,0.2,0.2,null,null,null,null,null,null,null,null,null,null,null,null,null,null,null,null,{"$f":"VLOOKUP(A11&D11&\"-\"&E11,ActiveFunds!$AH$4:$AI$787,2,0)","v":0}]
["045","","","001","1","045-Supreme Court",null,null,"001-1 General Fund-State",1,1,1,1,1,1,1,1,1,1,null,null,null,null,null,null,null,null,null,null,null,null,null,null,null,null,{"$f":"VLOOKUP(A12&D12&\"-\"&E12,ActiveFunds!$AH$4:$AI$787,2,0)","v":0}]
["046","","","001","1","046-State Law Library",null,null,"001-1 General Fund-State",1,1,1,1,1,1,1,1,1,1,null,null,null,null,null,null,null,null,null,null,null,null,null,null,null,null,{"$f":"VLOOKUP(A13&D13&\"-\"&E13,ActiveFunds!$AH$4:$AI$787,2,0)","v":0}]
["048","","","001","1","048-Court of Appeals",null,null,"001-1 General Fund-State",1,1,1,1,1,1,1,1,1,1,null,null,null,null,null,null,null,null,null,null,null,null,null,null,null,null,{"$f":"VLOOKUP(A14&D14&\"-\"&E14,ActiveFunds!$AH$4:$AI$787,2,0)","v":0}]
["050","","","001","1","050-Commission on Judicial Conduct",null,null,"001-1 General Fund-State",1,1,1,1,1,1,1,1,1,1,null,null,null,null,null,null,null,null,null,null,null,null,null,null,null,null,{"$f":"VLOOKUP(A15&D15&\"-\"&E15,ActiveFunds!$AH$4:$AI$787,2,0)","v":0}]
["055","","","001","1","055-Administrative Office of the Courts",null,null,"001-1 General Fund-State",1,1,1,1,1,1,1,1,1,1,null,null,null,null,null,null,null,null,null,null,null,null,null,null,null,null,{"$f":"VLOOKUP(A16&D16&\"-\"&E16,ActiveFunds!$AH$4:$AI$787,2,0)","v":0}]
["056","","","16A","1","056-Office of Public Defense",null,null,"16A-1 Judicial Stabilization Trust Accoun-State",1,1,1,1,1,1,1,1,1,1,null,null,null,null,null,null,null,null,null,null,null,null,null,null,null,null,{"$f":"VLOOKUP(A17&D17&\"-\"&E17,ActiveFunds!$AH$4:$AI$787,2,0)","v":0}]
["057","","","001","1","057-Office of Civil Legal Aid",null,null,"001-1 General Fund-State",1,1,1,1,1,1,1,1,1,1,null,null,null,null,null,null,null,null,null,null,null,null,null,null,null,null,{"$f":"VLOOKUP(A18&D18&\"-\"&E18,ActiveFunds!$AH$4:$AI$787,2,0)","v":0}]
["075","","","001","1","075-Office of the Governor",null,null,"001-1 General Fund-State",1,1,1,1,1,1,1,1,1,1,null,null,null,null,null,null,null,null,null,null,null,null,null,null,null,null,{"$f":"VLOOKUP(A19&D19&\"-\"&E19,ActiveFunds!$AH$4:$AI$787,2,0)","v":0}]
["080","","","001","1","080-Office of the Lieutenant Governor",null,null,"001-1 General Fund-State",1,1,1,1,1,1,1,1,1,1,null,null,null,null,null,null,null,null,null,null,null,null,null,null,null,null,{"$f":"VLOOKUP(A20&D20&\"-\"&E20,ActiveFunds!$AH$4:$AI$787,2,0)","v":0}]
["082","","","001","1","082-Public Disclosure Commission",null,null,"001-1 General Fund-State",1,1,1,1,1,1,1,1,1,1,null,null,null,null,null,null,null,null,null,null,null,null,null,null,null,null,{"$f":"VLOOKUP(A21&D21&\"-\"&E21,ActiveFunds!$AH$4:$AI$787,2,0)","v":0}]
["085","","","001","1","085-Office of the Secretary of State",null,null,"001-1 General Fund-State",0.33650000000000002,0.33650000000000002,0.33650000000000002,0.33650000000000002,0.33650000000000002,0.33650000000000002,0.33650000000000002,0.33650000000000002,0.33650000000000002,0.33650000000000002,null,null,null,null,null,null,null,null,null,null,null,null,null,null,null,null,{"$f":"VLOOKUP(A22&D22&\"-\"&E22,ActiveFunds!$AH$4:$AI$787,2,0)","v":0}]
["085","","","006","1","085-Office of the Secretary of State",null,null,"006-1 Public Records Effic/Presrv/Access-State",0.1449,0.1449,0.1449,0.1449,0.1449,0.1449,0.1449,0.1449,0.1449,0.1449,null,null,null,null,null,null,null,null,null,null,null,null,null,null,null,null,{"$f":"VLOOKUP(A23&D23&\"-\"&E23,ActiveFunds!$AH$4:$AI$787,2,0)","v":0}]
["085","","","407","6","085-Office of the Secretary of State",null,null,"407-6 Secretary of State's Revolving Acct-Non-Appropriated",0.223,0.223,0.223,0.223,0.223,0.223,0.223,0.223,0.223,0.223,null,null,null,null,null,null,null,null,null,null,null,null,null,null,null,null,{"$f":"VLOOKUP(A24&D24&\"-\"&E24,ActiveFunds!$AH$4:$AI$787,2,0)","v":0}]
["085","","","441","1","085-Office of the Secretary of State",null,null,"441-1 Local Government Archives Account-State",9.2100000000000001E-2,9.2100000000000001E-2,9.2100000000000001E-2,9.2100000000000001E-2,9.2100000000000001E-2,9.2100000000000001E-2,9.2100000000000001E-2,9.2100000000000001E-2,9.2100000000000001E-2,9.2100000000000001E-2,null,null,null,null,null,null,null,null,null,null,null,null,null,null,null,null,{"$f":"VLOOKUP(A25&D25&\"-\"&E25,ActiveFunds!$AH$4:$AI$787,2,0)","v":0}]
["085","","","14E","1","085-Office of the Secretary of State",null,null,"14E-1 WA State Heritage Center Account-State",0.20349999999999999,0.20349999999999999,0.20349999999999999,0.20349999999999999,0.20349999999999999,0.20349999999999999,0.20349999999999999,0.20349999999999999,0.20349999999999999,0.20349999999999999,null,null,null,null,null,null,null,null,null,null,null,null,null,null,null,null,{"$f":"VLOOKUP(A26&D26&\"-\"&E26,ActiveFunds!$AH$4:$AI$787,2,0)","v":0}]
["086","","","001","1","086-Governor's Office of Indian Affairs",null,null,"001-1 General Fund-State",1,1,1,1,1,1,1,1,1,1,null,null,null,null,null,null,null,null,null,null,null,null,null,null,null,null,{"$f":"VLOOKUP(A27&D27&\"-\"&E27,ActiveFunds!$AH$4:$AI$787,2,0)","v":0}]
["087","","","001","1","087-Asian-Pacific-American Affrs",null,null,"001-1 General Fund-State",1,1,1,1,1,1,1,1,1,1,null,null,null,null,null,null,null,null,null,null,null,null,null,null,null,null,{"$f":"VLOOKUP(A28&D28&\"-\"&E28,ActiveFunds!$AH$4:$AI$787,2,0)","v":0}]
["090","","","404","1","090-Office of the State Treasurer",null,null,"404-1 State Treasurer's Service Account-State",1,1,1,1,1,1,1,1,1,1,null,null,null,null,null,null,null,null,null,null,null,null,null,null,null,null,{"$f":"VLOOKUP(A29&D29&\"-\"&E29,ActiveFunds!$AH$4:$AI$787,2,0)","v":0}]
["091","","","001","1","091-Redistricting Commission",null,null,"001-1 General Fund-State",1,1,1,1,1,1,1,1,1,1,null,null,null,null,null,null,null,null,null,null,null,null,null,null,null,null,{"$f":"VLOOKUP(A30&D30&\"-\"&E30,ActiveFunds!$AH$4:$AI$787,2,0)","v":{"$error":"#N/A"}}]
["095","","","001","1","095-Office of the State Auditor",null,null,"001-1 General Fund-State",0,0,0,0,0,0,0,0,0,0,null,null,null,null,null,null,null,null,null,null,null,null,null,null,null,null,{"$f":"VLOOKUP(A31&D31&\"-\"&E31,ActiveFunds!$AH$4:$AI$787,2,0)","v":0}]
["095","","","413","6","095-Office of the State Auditor",null,null,"413-6 Municipal Revolving Account-Non-Appropriated",0.6,0.54,0.6,0.25,0.6,0.6,0.64,0.6,0.6,0.6,null,null,null,null,null,null,null,null,null,null,null,null,null,null,null,null,{"$f":"VLOOKUP(A32&D32&\"-\"&E32,ActiveFunds!$AH$4:$AI$787,2,0)","v":0}]
["095","","","483","1","095-Office of the State Auditor",null,null,"483-1 Auditing Services Revolving Acct-State",0.13,0.17,0.13,0.35,0.13,0.13,0.13,0.13,0.13,0.13,null,null,null,null,null,null,null,null,null,null,null,null,null,null,null,null,{"$f":"VLOOKUP(A33&D33&\"-\"&E33,ActiveFunds!$AH$4:$AI$787,2,0)","v":0}]
[{"$f":"LEFT(F34,3)","v":"095"},{"$f":"IF(G34=\"\",\"\",LEFT(G34,3))","v":""},{"$f":"IF(H34=\"\",\"\",LEFT(H34,4))","v":""},{"$f":"LEFT(I34,3)","v":"553"},{"$f":"MID(I34,5,1)","v":"1"},"095-Office of the State Auditor",null,null,"553-1 Performance Audits of Govt Acct-State",0.02,0.01,0.02,0,0.02,0.02,0.02,0.02,0.02,0.02,null,null,null,null,null,null,null,null,null,null,null,null,null,null,null,null,{"$f":"VLOOKUP(A34&D34&\"-\"&E34,ActiveFunds!$AH$4:$AI$787,2,0)","v":0}]
["095","","","553","6","095-Office of the State Auditor",null,null,"553-6 Performance Audits of Govt Acct-Non-Appropriated",0.25,0.28000000000000003,0.25,0.4,0.25,0.25,0.21,0.25,0.25,0.25,null,null,null,null,null,null,null,null,null,null,null,null,null,null,null,null,{"$f":"VLOOKUP(A35&D35&\"-\"&E35,ActiveFunds!$AH$4:$AI$787,2,0)","v":0}]
["099","","","001","1","099-Comm Salaries for Elected Officials",null,null,"001-1 General Fund-State",1,1,1,1,1,1,1,1,1,1,null,null,null,null,null,null,null,null,null,null,null,null,null,null,null,null,{"$f":"VLOOKUP(A36&D36&\"-\"&E36,ActiveFunds!$AH$4:$AI$787,2,0)","v":0}]
["100","","","001","1","100-Office of the Attorney General",null,null,"001-1 General Fund-State",8.8666051455028566E-2,8.8666051455028566E-2,0,8.8666051455028566E-2,8.8666051455028566E-2,8.8666051455028566E-2,8.8666051455028566E-2,8.8666051455028566E-2,8.8666051455028566E-2,8.8666051455028566E-2,null,null,null,null,null,null,null,null,null,null,null,null,null,null,null,null,{"$f":"VLOOKUP(A37&D37&\"-\"&E37,ActiveFunds!$AH$4:$AI$787,2,0)","v":0}]
["100","","","111","1","100-Office of the Attorney General",null,null,"111-1 Public Service Revolving Account-State",8.9139393167968692E-3,8.9139393167968692E-3,0,8.9139393167968692E-3,8.9139393167968692E-3,8.9139393167968692E-3,8.9139393167968692E-3,8.9139393167968692E-3,8.9139393167968692E-3,8.9139393167968692E-3,null,null,null,null,null,null,null,null,null,null,null,null,null,null,null,null,{"$f":"VLOOKUP(A38&D38&\"-\"&E38,ActiveFunds!$AH$4:$AI$787,2,0)","v":0}]
["100","","","12F","6","100-Office of the Attorney General",null,null,"12F-6 Manufactured/Mobile Home Dispute-Non-Appropriated",3.6793368442825094E-3,3.6793368442825094E-3,0.8571428571428571,3.6793368442825094E-3,3.6793368442825094E-3,3.6793368442825094E-3,3.6793368442825094E-3,3.6793368442825094E-3,3.6793368442825094E-3,3.6793368442825094E-3,null,null,null,null,null,null,null,null,null,null,null,null,null,null,null,null,{"$f":"VLOOKUP(A39&D39&\"-\"&E39,ActiveFunds!$AH$4:$AI$787,2,0)","v":0}]
["100","","","154","1","100-Office of the Attorney General",null,null,"154-1 New Motor Vehicle Arbitration Acct-State",4.1805221873955868E-3,4.1805221873955868E-3,0,4.1805221873955868E-3,4.1805221873955868E-3,4.1805221873955868E-3,4.1805221873955868E-3,4.1805221873955868E-3,4.1805221873955868E-3,4.1805221873955868E-3,null,null,null,null,null,null,null,null,null,null,null,null,null,null,null,null,{"$f":"VLOOKUP(A40&D40&\"-\"&E40,ActiveFunds!$AH$4:$AI$787,2,0)","v":0}]
["100","","","17L","6","100-Office of the Attorney General",null,null,"17L-6 Foreclosure Fairness Account-Non-Appropriated",2.8122066474678209E-3,2.8122066474678209E-3,0,2.8122066474678209E-3,2.8122066474678209E-3,2.8122066474678209E-3,2.8122066474678209E-3,2.8122066474678209E-3,2.8122066474678209E-3,2.8122066474678209E-3,null,null,null,null,null,null,null,null,null,null,null,null,null,null,null,null,{"$f":"VLOOKUP(A41&D41&\"-\"&E41,ActiveFunds!$AH$4:$AI$787,2,0)","v":0}]
["100","","","405","1","100-Office of the Attorney General",null,null,"405-1 Legal Services Revolving Account-State",0.88232088590475888,0.88232088590475888,0.14285714285714285,0.88232088590475888,0.88232088590475888,0.88232088590475888,0.88232088590475888,0.88232088590475888,0.88232088590475888,0.88232088590475888,null,null,null,null,null,null,null,null,null,null,null,null,null,null,null,null,{"$f":"VLOOKUP(A42&D42&\"-\"&E42,ActiveFunds!$AH$4:$AI$787,2,0)","v":0}]
["100","","","424","6","100-Office of the Attorney General",null,null,"424-6 Anti-Trust Revolving Account-Non-Appropriated",8.8860956866239193E-3,8.8860956866239193E-3,0,8.8860956866239193E-3,8.8860956866239193E-3,8.8860956866239193E-3,8.8860956866239193E-3,8.8860956866239193E-3,8.8860956866239193E-3,8.8860956866239193E-3,null,null,null,null,null,null,null,null,null,null,null,null,null,null,null,null,{"$f":"VLOOKUP(A43&D43&\"-\"&E43,ActiveFunds!$AH$4:$AI$787,2,0)","v":0}]
["100","","","828","1","100-Office of the Attorney General",null,null,"828-1 Tobacco Prevention and Control Acct-State",5.409619576458609E-4,5.409619576458609E-4,0,5.409619576458609E-4,5.409619576458609E-4,5.409619576458609E-4,5.409619576458609E-4,5.409619576458609E-4,5.409619576458609E-4,5.409619576458609E-4,null,null,null,null,null,null,null,null,null,null,null,null,null,null,null,null,{"$f":"VLOOKUP(A44&D44&\"-\"&E44,ActiveFunds!$AH$4:$AI$787,2,0)","v":0}]
["101","","","001","1","101-Caseload Forecast Council",null,null,"001-1 General Fund-State",1,1,1,1,1,1,1,1,1,1,null,null,null,null,null,null,null,null,null,null,null,null,null,null,null,null,{"$f":"VLOOKUP(A45&D45&\"-\"&E45,ActiveFunds!$AH$4:$AI$787,2,0)","v":0}]
["102","","","300","6","102-Dept of Financial Institutions",null,null,"300-6 Financial Services Regulation Acct-Non-Appropriated",1,1,1,1,1,1,1,1,1,1,null,null,null,null,null,null,null,null,null,null,null,null,null,null,null,null,{"$f":"VLOOKUP(A46&D46&\"-\"&E46,ActiveFunds!$AH$4:$AI$787,2,0)","v":0}]
["103","","","001","1","103-Department of Commerce",null,null,"001-1 General Fund-State",0.35920000000000002,0.35920000000000002,0.35920000000000002,0.35920000000000002,0.35920000000000002,0.61060000000000003,0.35920000000000002,0.35920000000000002,0.35920000000000002,0.35920000000000002,null,null,null,null,null,null,null,null,null,null,null,null,null,null,null,null,{"$f":"VLOOKUP(A47&D47&\"-\"&E47,ActiveFunds!$AH$4:$AI$787,2,0)","v":0}]
["103","","","001","2","103-Department of Commerce",null,null,"001-2 General Fund-Federal",0.25140000000000001,0.25140000000000001,0.25140000000000001,0.25140000000000001,0.25140000000000001,0,0.25140000000000001,0.25140000000000001,0.25140000000000001,0.25140000000000001,null,null,null,null,null,null,null,null,null,null,null,null,null,null,null,null,{"$f":"VLOOKUP(A48&D48&\"-\"&E48,ActiveFunds!$AH$4:$AI$787,2,0)","v":0}]
["103","","","001","7","103-Department of Commerce",null,null,"001-7 General Fund-Private/Local",9.9000000000000005E-2,9.9000000000000005E-2,9.9000000000000005E-2,9.9000000000000005E-2,9.9000000000000005E-2,9.9000000000000005E-2,9.9000000000000005E-2,9.9000000000000005E-2,9.9000000000000005E-2,9.9000000000000005E-2,null,null,null,null,null,null,null,null,null,null,null,null,null,null,null,null,{"$f":"VLOOKUP(A49&D49&\"-\"&E49,ActiveFunds!$AH$4:$AI$787,2,0)","v":0}]
["103","","","001","8","103-Department of Commerce",null,null,"001-8 General Fund-Federal ARRA",0,0,0,0,0,0,0,0,0,0,null,null,null,null,null,null,null,null,null,null,null,null,null,null,null,null,{"$f":"VLOOKUP(A50&D50&\"-\"&E50,ActiveFunds!$AH$4:$AI$787,2,0)","v":0}]
["103","","","04R","1","103-Department of Commerce",null,null,"04R-1 Drinking Water Assistance Account-State",1.6400000000000001E-2,1.6400000000000001E-2,1.6400000000000001E-2,1.6400000000000001E-2,1.6400000000000001E-2,1.6400000000000001E-2,1.6400000000000001E-2,1.6400000000000001E-2,1.6400000000000001E-2,1.6400000000000001E-2,null,null,null,null,null,null,null,null,null,null,null,null,null,null,null,null,{"$f":"VLOOKUP(A51&D51&\"-\"&E51,ActiveFunds!$AH$4:$AI$787,2,0)","v":0}]
["103","","","058","1","103-Department of Commerce",null,null,"058-1 Public Works Assistance Account-State",5.2200000000000003E-2,5.2200000000000003E-2,5.2200000000000003E-2,5.2200000000000003E-2,5.2200000000000003E-2,5.2200000000000003E-2,5.2200000000000003E-2,5.2200000000000003E-2,5.2200000000000003E-2,5.2200000000000003E-2,null,null,null,null,null,null,null,null,null,null,null,null,null,null,null,null,{"$f":"VLOOKUP(A52&D52&\"-\"&E52,ActiveFunds!$AH$4:$AI$787,2,0)","v":0}]
["103","","","05R","1","103-Department of Commerce",null,null,"05R-1 Drinking Water Assist Admin Acct-State",6.4999999999999997E-3,6.4999999999999997E-3,6.4999999999999997E-3,6.4999999999999997E-3,6.4999999999999997E-3,6.4999999999999997E-3,6.4999999999999997E-3,6.4999999999999997E-3,6.4999999999999997E-3,6.4999999999999997E-3,null,null,null,null,null,null,null,null,null,null,null,null,null,null,null,null,{"$f":"VLOOKUP(A53&D53&\"-\"&E53,ActiveFunds!$AH$4:$AI$787,2,0)","v":0}]
["103","","","06K","1","103-Department of Commerce",null,null,"06K-1 Lead Paint Account-State",3.2000000000000002E-3,3.2000000000000002E-3,3.2000000000000002E-3,3.2000000000000002E-3,3.2000000000000002E-3,3.2000000000000002E-3,3.2000000000000002E-3,3.2000000000000002E-3,3.2000000000000002E-3,3.2000000000000002E-3,null,null,null,null,null,null,null,null,null,null,null,null,null,null,null,null,{"$f":"VLOOKUP(A54&D54&\"-\"&E54,ActiveFunds!$AH$4:$AI$787,2,0)","v":0}]
["103","","","10B","1","103-Department of Commerce",null,null,"10B-1 Home Security Fund Account-State",5.62E-2,5.62E-2,5.62E-2,5.62E-2,5.62E-2,5.62E-2,5.62E-2,5.62E-2,5.62E-2,5.62E-2,null,null,null,null,null,null,null,null,null,null,null,null,null,null,null,null,{"$f":"VLOOKUP(A55&D55&\"-\"&E55,ActiveFunds!$AH$4:$AI$787,2,0)","v":0}]
["103","","","12C","1","103-Department of Commerce",null,null,"12C-1 Affordable Housing For All-State",6.0000000000000001E-3,6.0000000000000001E-3,6.0000000000000001E-3,6.0000000000000001E-3,6.0000000000000001E-3,6.0000000000000001E-3,6.0000000000000001E-3,6.0000000000000001E-3,6.0000000000000001E-3,6.0000000000000001E-3,null,null,null,null,null,null,null,null,null,null,null,null,null,null,null,null,{"$f":"VLOOKUP(A56&D56&\"-\"&E56,ActiveFunds!$AH$4:$AI$787,2,0)","v":0}]
["103","","","150","1","103-Department of Commerce",null,null,"150-1 Low-Income Weath/Struct Rehab Asst-State",4.7000000000000002E-3,4.7000000000000002E-3,4.7000000000000002E-3,4.7000000000000002E-3,4.7000000000000002E-3,4.7000000000000002E-3,4.7000000000000002E-3,4.7000000000000002E-3,4.7000000000000002E-3,4.7000000000000002E-3,null,null,null,null,null,null,null,null,null,null,null,null,null,null,null,null,{"$f":"VLOOKUP(A57&D57&\"-\"&E57,ActiveFunds!$AH$4:$AI$787,2,0)","v":0}]
["103","","","15A","6","103-Department of Commerce",null,null,"15A-6 Transitional Housing Oper & Rent-Non-Appropriated",5.0000000000000001E-4,5.0000000000000001E-4,5.0000000000000001E-4,5.0000000000000001E-4,5.0000000000000001E-4,5.0000000000000001E-4,5.0000000000000001E-4,5.0000000000000001E-4,5.0000000000000001E-4,5.0000000000000001E-4,null,null,null,null,null,null,null,null,null,null,null,null,null,null,null,null,{"$f":"VLOOKUP(A58&D58&\"-\"&E58,ActiveFunds!$AH$4:$AI$787,2,0)","v":0}]
["103","","","174","1","103-Department of Commerce",null,null,"174-1 Local Toxics Control Account-State",4.0000000000000002E-4,4.0000000000000002E-4,4.0000000000000002E-4,4.0000000000000002E-4,4.0000000000000002E-4,4.0000000000000002E-4,4.0000000000000002E-4,4.0000000000000002E-4,4.0000000000000002E-4,4.0000000000000002E-4,null,null,null,null,null,null,null,null,null,null,null,null,null,null,null,null,{"$f":"VLOOKUP(A59&D59&\"-\"&E59,ActiveFunds!$AH$4:$AI$787,2,0)","v":{"$error":"#N/A"}}]
["103","","","17L","6","103-Department of Commerce",null,null,"17L-6 Foreclosure Fairness Account-Non-Appropriated",2.47E-2,2.47E-2,2.47E-2,2.47E-2,2.47E-2,2.47E-2,2.47E-2,2.47E-2,2.47E-2,2.47E-2,null,null,null,null,null,null,null,null,null,null,null,null,null,null,null,null,{"$f":"VLOOKUP(A60&D60&\"-\"&E60,ActiveFunds!$AH$4:$AI$787,2,0)","v":0}]
["103","","","205","6","103-Department of Commerce",null,null,"205-6 Mobile Home Park Relocation Account-Non-Appropriated",3.3999999999999998E-3,3.3999999999999998E-3,3.3999999999999998E-3,3.3999999999999998E-3,3.3999999999999998E-3,3.3999999999999998E-3,3.3999999999999998E-3,3.3999999999999998E-3,3.3999999999999998E-3,3.3999999999999998E-3,null,null,null,null,null,null,null,null,null,null,null,null,null,null,null,null,{"$f":"VLOOKUP(A61&D61&\"-\"&E61,ActiveFunds!$AH$4:$AI$787,2,0)","v":0}]
["103","","","263","1","103-Department of Commerce",null,null,"263-1 Community/Economic Development Fee-State",2.1700000000000001E-2,2.1700000000000001E-2,2.1700000000000001E-2,2.1700000000000001E-2,2.1700000000000001E-2,2.1700000000000001E-2,2.1700000000000001E-2,2.1700000000000001E-2,2.1700000000000001E-2,2.1700000000000001E-2,null,null,null,null,null,null,null,null,null,null,null,null,null,null,null,null,{"$f":"VLOOKUP(A62&D62&\"-\"&E62,ActiveFunds!$AH$4:$AI$787,2,0)","v":0}]
["103","","","501","1","103-Department of Commerce",null,null,"501-1 Liquor Revolving Account-State",1.1999999999999999E-3,1.1999999999999999E-3,1.1999999999999999E-3,1.1999999999999999E-3,1.1999999999999999E-3,1.1999999999999999E-3,1.1999999999999999E-3,1.1999999999999999E-3,1.1999999999999999E-3,1.1999999999999999E-3,null,null,null,null,null,null,null,null,null,null,null,null,null,null,null,null,{"$f":"VLOOKUP(A63&D63&\"-\"&E63,ActiveFunds!$AH$4:$AI$787,2,0)","v":0}]
["103","","","532","1","103-Department of Commerce",null,null,"532-1 Washington Housing Trust Account-State",7.7499999999999999E-2,7.7499999999999999E-2,7.7499999999999999E-2,7.7499999999999999E-2,7.7499999999999999E-2,7.7499999999999999E-2,7.7499999999999999E-2,7.7499999999999999E-2,7.7499999999999999E-2,7.7499999999999999E-2,null,null,null,null,null,null,null,null,null,null,null,null,null,null,null,null,{"$f":"VLOOKUP(A64&D64&\"-\"&E64,ActiveFunds!$AH$4:$AI$787,2,0)","v":0}]
["103","","","887","1","103-Department of Commerce",null,null,"887-1 Public Facility Const Loan Revolv-State",1.5800000000000002E-2,1.5800000000000002E-2,1.5800000000000002E-2,1.5800000000000002E-2,1.5800000000000002E-2,1.5800000000000002E-2,1.5800000000000002E-2,1.5800000000000002E-2,1.5800000000000002E-2,1.5800000000000002E-2,null,null,null,null,null,null,null,null,null,null,null,null,null,null,null,null,{"$f":"VLOOKUP(A65&D65&\"-\"&E65,ActiveFunds!$AH$4:$AI$787,2,0)","v":0}]
["104","","","001","1","104-Economic & Revenue Forecast Council",null,null,"001-1 General Fund-State",1,1,1,1,1,1,1,1,1,1,null,null,null,null,null,null,null,null,null,null,null,null,null,null,null,null,{"$f":"VLOOKUP(A66&D66&\"-\"&E66,ActiveFunds!$AH$4:$AI$787,2,0)","v":0}]
["105","","","001","1","105-Office of Financial Management",null,null,"001-1 General Fund-State",0.42,0.42,0.42,0.42,0.42,0.42,0.42,0.42,0.42,0.42,null,null,null,null,null,null,null,null,null,null,null,null,null,null,null,null,{"$f":"VLOOKUP(A67&D67&\"-\"&E67,ActiveFunds!$AH$4:$AI$787,2,0)","v":0}]
["105","","","415","1","105-Office of Financial Management",null,null,"415-1 Personnel Service Account-State",0.15,0.15,0.15,0.15,0.15,0.15,0.15,0.15,0.15,0.15,null,null,null,null,null,null,null,null,null,null,null,null,null,null,null,null,{"$f":"VLOOKUP(A68&D68&\"-\"&E68,ActiveFunds!$AH$4:$AI$787,2,0)","v":0}]
["105","","","419","1","105-Office of Financial Management",null,null,"419-1 Data Processing Revolving Account-State",0,0,0,0,0,0,0,0,0,0,null,null,null,null,null,null,null,null,null,null,null,null,null,null,null,null,{"$f":"VLOOKUP(A69&D69&\"-\"&E69,ActiveFunds!$AH$4:$AI$787,2,0)","v":0}]
["105","","","436","6","105-Office of Financial Management",null,null,"436-6 OFM Labor Relations Service Acct-Non-Appropriated",0.1,0.1,0.1,0.1,0.1,0.1,0.1,0.1,0.1,0.1,null,null,null,null,null,null,null,null,null,null,null,null,null,null,null,null,{"$f":"VLOOKUP(A70&D70&\"-\"&E70,ActiveFunds!$AH$4:$AI$787,2,0)","v":0}]
["105","","","468","1","105-Office of Financial Management",null,null,"468-1 OFM Central Services-State",0.33,0.33,0.33,0.33,0.33,0.33,0.33,0.33,0.33,0.33,null,null,null,null,null,null,null,null,null,null,null,null,null,null,null,null,{"$f":"VLOOKUP(A71&D71&\"-\"&E71,ActiveFunds!$AH$4:$AI$787,2,0)","v":0}]
["107","OTH","","001","1","107-WA State Health Care Authority","OTH-Health Care Auth-Other",null,"001-1 General Fund-State",0.42,0.32,0.52,0.42,0.42,0.9,0.42,0.42,0.42,0.42,null,null,null,null,null,null,null,null,null,null,null,null,null,null,null,null,{"$f":"VLOOKUP(A72&D72&\"-\"&E72,ActiveFunds!$AH$4:$AI$787,2,0)","v":0}]
["107","OTH","","001","2","107-WA State Health Care Authority","OTH-Health Care Auth-Other",null,"001-2 General Fund-Federal",0.49,0.28000000000000003,0.46,0.49,0.49,0,0.48,0.49,0.49,0.49,null,null,null,null,null,null,null,null,null,null,null,null,null,null,null,null,{"$f":"VLOOKUP(A73&D73&\"-\"&E73,ActiveFunds!$AH$4:$AI$787,2,0)","v":0}]
["107","PEB","","418","1","107-WA State Health Care Authority","PEB-Health Care Auth-Employee Benefits",null,"418-1 St Health Care Authority Admin Acct-State",0.09,0.4,0.02,0.09,0.09,0.1,0.1,0.09,0.09,0.09,null,null,null,null,null,null,null,null,null,null,null,null,null,null,null,null,{"$f":"VLOOKUP(A74&D74&\"-\"&E74,ActiveFunds!$AH$4:$AI$787,2,0)","v":0}]
["107","SEB","","492","1","107-WA State Health Care Authority","SEB-School Employee Benefits Board",null,"492-1 School Employees' Insurance Account",0,0,0,0,0,0,0,0,0,0,null,null,null,null,null,null,null,null,null,null,null,null,null,null,null,null,{"$f":"VLOOKUP(A75&D75&\"-\"&E75,ActiveFunds!$AH$4:$AI$787,2,0)","v":0}]
[{"$f":"LEFT(F76,3)","v":"110"},{"$f":"IF(G76=\"\",\"\",LEFT(G76,3))","v":""},{"$f":"IF(H76=\"\",\"\",LEFT(H76,4))","v":""},{"$f":"LEFT(I76,3)","v":"484"},{"$f":"MID(I76,5,1)","v":"1"},"110-Office of Administrative Hearings",null,null,"484-1 Administrative Hearings Revolving-State",1,1,1,1,1,1,1,1,1,1,null,null,null,null,null,null,null,null,null,null,null,null,null,null,null,null,{"$f":"VLOOKUP(A76&D76&\"-\"&E76,ActiveFunds!$AH$4:$AI$787,2,0)","v":0}]
["116","","","578","1","116-State Lottery Commission",null,null,"578-1 Lottery Administrative Account-State",1,1,1,1,1,1,1,1,1,1,null,null,null,null,null,null,null,null,null,null,null,null,null,null,null,null,{"$f":"VLOOKUP(A77&D77&\"-\"&E77,ActiveFunds!$AH$4:$AI$787,2,0)","v":0}]
["117","","","884","6","117-Washington State Gambling Comm",null,null,"884-6 Gambling Revolving Account-Non-Appropriated",1,1,1,1,1,1,1,1,1,1,null,null,null,null,null,null,null,null,null,null,null,null,null,null,null,null,{"$f":"VLOOKUP(A78&D78&\"-\"&E78,ActiveFunds!$AH$4:$AI$787,2,0)","v":0}]
["118","","","001","1","118-WA State Comm on Hispanic Affairs",null,null,"001-1 General Fund-State",1,1,1,1,1,1,1,1,1,1,null,null,null,null,null,null,null,null,null,null,null,null,null,null,null,null,{"$f":"VLOOKUP(A79&D79&\"-\"&E79,ActiveFunds!$AH$4:$AI$787,2,0)","v":0}]
["119","","","001","1","119-African-American Affairs Comm",null,null,"001-1 General Fund-State",1,1,1,1,1,1,1,1,1,1,null,null,null,null,null,null,null,null,null,null,null,null,null,null,null,null,{"$f":"VLOOKUP(A80&D80&\"-\"&E80,ActiveFunds!$AH$4:$AI$787,2,0)","v":0}]
["120","","","001","1","120-Human Rights Commission",null,null,"001-1 General Fund-State",1,1,1,1,1,1,1,1,1,1,null,null,null,null,null,null,null,null,null,null,null,null,null,null,null,null,{"$f":"VLOOKUP(A81&D81&\"-\"&E81,ActiveFunds!$AH$4:$AI$787,2,0)","v":0}]
["124","","","600","1","124-Department of Retirement Systems",null,null,"600-1 Dept of Retirement Systems Expense-State",0.93200000000000005,0.1129,0.93200000000000005,0.93200000000000005,0.93200000000000005,0.93200000000000005,0.93200000000000005,0.93200000000000005,0.93200000000000005,0.93200000000000005,null,null,null,null,null,null,null,null,null,null,null,null,null,null,null,null,{"$f":"VLOOKUP(A82&D82&\"-\"&E82,ActiveFunds!$AH$4:$AI$787,2,0)","v":0}]
["124","","","874","6","124-Department of Retirement Systems",null,null,"874-6 OASI Revolving Account-Non-Appropriated",5.4999999999999997E-3,0,5.4999999999999997E-3,5.4999999999999997E-3,5.4999999999999997E-3,5.4999999999999997E-3,5.4999999999999997E-3,5.4999999999999997E-3,5.4999999999999997E-3,5.4999999999999997E-3,null,null,null,null,null,null,null,null,null,null,null,null,null,null,null,null,{"$f":"VLOOKUP(A83&D83&\"-\"&E83,ActiveFunds!$AH$4:$AI$787,2,0)","v":0}]
["124","","","888","6","124-Department of Retirement Systems",null,null,"888-6 Deferred Compensation Admin Account-Non-Appropriated",6.25E-2,1.11E-2,6.25E-2,6.25E-2,6.25E-2,6.25E-2,6.25E-2,6.25E-2,6.25E-2,6.25E-2,null,null,null,null,null,null,null,null,null,null,null,null,null,null,null,null,{"$f":"VLOOKUP(A84&D84&\"-\"&E84,ActiveFunds!$AH$4:$AI$787,2,0)","v":0}]
["124","","","Non","B","124-Department of Retirement Systems",null,null,"Non Budgeted Fund",0,0.876,0,0,0,0,0,0,0,0,null,null,null,null,null,null,null,null,null,null,null,null,null,null,null,null,{"$f":"VLOOKUP(A85&D85&\"-\"&E85,ActiveFunds!$AH$4:$AI$787,2,0)","v":{"$error":"#N/A"}}]
["126","","","031","1","126-State Investment Board",null,null,"031-1 State Investment Board Expense Acct-State",1,1,1,1,1,1,1,1,1,1,null,null,null,null,null,null,null,null,null,null,null,null,null,null,null,null,{"$f":"VLOOKUP(A86&D86&\"-\"&E86,ActiveFunds!$AH$4:$AI$787,2,0)","v":0}]
["140","","","001","1","140-Department of Revenue",null,null,"001-1 General Fund-State",0.89,0.89,0.89,0.89,0.89,0.89,0.89,0.89,0.89,0.89,null,null,null,null,null,null,null,null,null,null,null,null,null,null,null,null,{"$f":"VLOOKUP(A87&D87&\"-\"&E87,ActiveFunds!$AH$4:$AI$787,2,0)","v":0}]
["140","","","02W","1","140-Department of Revenue",null,null,"02W-1 Timber Tax Distribution Account-State",2.5000000000000001E-2,2.5000000000000001E-2,2.5000000000000001E-2,2.5000000000000001E-2,2.5000000000000001E-2,2.5000000000000001E-2,2.5000000000000001E-2,2.5000000000000001E-2,2.5000000000000001E-2,2.5000000000000001E-2,null,null,null,null,null,null,null,null,null,null,null,null,null,null,null,null,{"$f":"VLOOKUP(A88&D88&\"-\"&E88,ActiveFunds!$AH$4:$AI$787,2,0)","v":0}]
["140","","","03N","1","140-Department of Revenue",null,null,"03N-1 Business License Account-State",0.05,0.05,0.05,0.05,0.05,0.05,0.05,0.05,0.05,0.05,null,null,null,null,null,null,null,null,null,null,null,null,null,null,null,null,{"$f":"VLOOKUP(A89&D89&\"-\"&E89,ActiveFunds!$AH$4:$AI$787,2,0)","v":0}]
["140","","","196","6","140-Department of Revenue",null,null,"196-6 Unclaimed Personal Property Account-Non-Appropriated",3.5000000000000003E-2,3.5000000000000003E-2,3.5000000000000003E-2,3.5000000000000003E-2,3.5000000000000003E-2,3.5000000000000003E-2,3.5000000000000003E-2,3.5000000000000003E-2,3.5000000000000003E-2,3.5000000000000003E-2,null,null,null,null,null,null,null,null,null,null,null,null,null,null,null,null,{"$f":"VLOOKUP(A90&D90&\"-\"&E90,ActiveFunds!$AH$4:$AI$787,2,0)","v":0}]
["142","","","001","1","142-Board of Tax Appeals",null,null,"001-1 General Fund-State",1,1,1,1,1,1,1,1,1,1,null,null,null,null,null,null,null,null,null,null,null,null,null,null,null,null,{"$f":"VLOOKUP(A91&D91&\"-\"&E91,ActiveFunds!$AH$4:$AI$787,2,0)","v":0}]
["147","","","453","1","147-Minority & Women's Business Enterp",null,null,"453-1 OMWBE Enterprises Account-State",1,1,1,1,1,1,1,1,1,1,null,null,null,null,null,null,null,null,null,null,null,null,null,null,null,null,{"$f":"VLOOKUP(A92&D92&\"-\"&E92,ActiveFunds!$AH$4:$AI$787,2,0)","v":0}]
["160","","","138","1","160-Office of Insurance Commissioner",null,null,"138-1 Insurance Commissioner's Regulatory-State",1,1,1,1,1,1,1,1,1,1,null,null,null,null,null,null,null,null,null,null,null,null,null,null,null,null,{"$f":"VLOOKUP(A93&D93&\"-\"&E93,ActiveFunds!$AH$4:$AI$787,2,0)","v":0}]
["163","","","458","1","163-Consolidated Technology Services",null,null,"458-1 Consolidated Tech Services Rev Acct-State",6.3E-2,6.3E-2,6.3E-2,6.3E-2,6.3E-2,6.3E-2,6.3E-2,6.3E-2,6.3E-2,6.3E-2,null,null,null,null,null,null,null,null,null,null,null,null,null,null,null,null,{"$f":"VLOOKUP(A94&D94&\"-\"&E94,ActiveFunds!$AH$4:$AI$787,2,0)","v":0}]
["163","","","458","6","163-Consolidated Technology Services",null,null,"458-6 Consolidated Tech Services Rev Acct-Non-Appropriated",0.93700000000000006,0.93700000000000006,0.93700000000000006,0.93700000000000006,0.93700000000000006,0.93700000000000006,0.93700000000000006,0.93700000000000006,0.93700000000000006,0.93700000000000006,null,null,null,null,null,null,null,null,null,null,null,null,null,null,null,null,{"$f":"VLOOKUP(A95&D95&\"-\"&E95,ActiveFunds!$AH$4:$AI$787,2,0)","v":0}]
["163","","","461","6","163-Consolidated Technology Services",null,null,"461-6 Shared IT Systems Revolving Acct-Non-Appropriated",0,0,0,0,0,0,0,0,0,0,null,null,null,null,null,null,null,null,null,null,null,null,null,null,null,null,{"$f":"VLOOKUP(A96&D96&\"-\"&E96,ActiveFunds!$AH$4:$AI$787,2,0)","v":0}]
["163","","","472","6","163-Consolidated Technology Services",null,null,"472-6 Statewide IT Systems M&O Rev Acct-Non-Appropriated",0,0,0,0,0,0,0,0,0,0,null,null,null,null,null,null,null,null,null,null,null,null,null,null,null,null,{"$f":"VLOOKUP(A97&D97&\"-\"&E97,ActiveFunds!$AH$4:$AI$787,2,0)","v":0}]
[{"$f":"LEFT(F98,3)","v":"165"},{"$f":"IF(G98=\"\",\"\",LEFT(G98,3))","v":""},{"$f":"IF(H98=\"\",\"\",LEFT(H98,4))","v":""},{"$f":"LEFT(I98,3)","v":"02J"},{"$f":"MID(I98,5,1)","v":"1"},"165-State Board of Accountancy",null,null,"02J-1 Certified Public Accountants' Acct-State",1,1,1,1,1,1,1,1,1,1,null,null,null,null,null,null,null,null,null,null,null,null,null,null,null,null,{"$f":"VLOOKUP(A98&D98&\"-\"&E98,ActiveFunds!$AH$4:$AI$787,2,0)","v":0}]
[{"$f":"LEFT(F99,3)","v":"167"},{"$f":"IF(G99=\"\",\"\",LEFT(G99,3))","v":""},{"$f":"IF(H99=\"\",\"\",LEFT(H99,4))","v":""},{"$f":"LEFT(I99,3)","v":"02K"},{"$f":"MID(I99,5,1)","v":"1"},"167-Forensic Investigations Council",null,null,"02K-1 Death Investigations Account-State",1,1,1,1,1,1,1,1,1,1,null,null,null,null,null,null,null,null,null,null,null,null,null,null,null,null,{"$f":"VLOOKUP(A99&D99&\"-\"&E99,ActiveFunds!$AH$4:$AI$787,2,0)","v":0}]
[{"$f":"LEFT(F100,3)","v":"179"},{"$f":"IF(G100=\"\",\"\",LEFT(G100,3))","v":""},{"$f":"IF(H100=\"\",\"\",LEFT(H100,4))","v":""},{"$f":"LEFT(I100,3)","v":"422"},{"$f":"MID(I100,5,1)","v":"6"},"179-Dept of Enterprise Services",null,null,"422-6 Enterprise Services Account-Non-Appropriated",0.92400000000000004,0.92400000000000004,0.92400000000000004,0.92400000000000004,0.92400000000000004,0.92400000000000004,0.92400000000000004,0.92400000000000004,0.92400000000000004,0.92400000000000004,null,null,null,null,null,null,null,null,null,null,null,null,null,null,null,null,{"$f":"VLOOKUP(A100&D100&\"-\"&E100,ActiveFunds!$AH$4:$AI$787,2,0)","v":0}]
[{"$f":"LEFT(F101,3)","v":"179"},{"$f":"IF(G101=\"\",\"\",LEFT(G101,3))","v":""},{"$f":"IF(H101=\"\",\"\",LEFT(H101,4))","v":""},{"$f":"LEFT(I101,3)","v":"546"},{"$f":"MID(I101,5,1)","v":"6"},"179-Dept of Enterprise Services",null,null,"546-6 Risk Management Administration Acct-Non-Appropriated",7.5999999999999998E-2,7.5999999999999998E-2,7.5999999999999998E-2,7.5999999999999998E-2,7.5999999999999998E-2,7.5999999999999998E-2,7.5999999999999998E-2,7.5999999999999998E-2,7.5999999999999998E-2,7.5999999999999998E-2,null,null,null,null,null,null,null,null,null,null,null,null,null,null,null,null,{"$f":"VLOOKUP(A101&D101&\"-\"&E101,ActiveFunds!$AH$4:$AI$787,2,0)","v":0}]
["185","","","169","6","185-Washington Horse Racing Commission",null,null,"169-6 Horse Racing Commission Op Account-Non Appropriated",1,1,1,1,1,1,1,1,1,1,null,null,null,null,null,null,null,null,null,null,null,null,null,null,null,null,{"$f":"VLOOKUP(A102&D102&\"-\"&E102,ActiveFunds!$AH$4:$AI$787,2,0)","v":0}]
[{"$f":"LEFT(F103,3)","v":"190"},{"$f":"IF(G103=\"\",\"\",LEFT(G103,3))","v":""},{"$f":"IF(H103=\"\",\"\",LEFT(H103,4))","v":""},{"$f":"LEFT(I103,3)","v":"608"},{"$f":"MID(I103,5,1)","v":"1"},"190-Bd of Industrial Insurance Appeals",null,null,"608-1 Accident Account-State",0.5,0.5,0.5,0.5,0.5,0.5,0.5,0.5,0.5,0.5,null,null,null,null,null,null,null,null,null,null,null,null,null,null,null,null,{"$f":"VLOOKUP(A103&D103&\"-\"&E103,ActiveFunds!$AH$4:$AI$787,2,0)","v":0}]
["190","","","609","1","190-Bd of Industrial Insurance Appeals",null,null,"609-1 Medical Aid Account-State",0.5,0.5,0.5,0.5,0.5,0.5,0.5,0.5,0.5,0.5,null,null,null,null,null,null,null,null,null,null,null,null,null,null,null,null,{"$f":"VLOOKUP(A104&D104&\"-\"&E104,ActiveFunds!$AH$4:$AI$787,2,0)","v":0}]
["195","","","315","1","195-Liquor and Cannabis Board",null,null,"315-1 Dedicated Marijuana Account-State",0.19,0.19,0.19,0.19,0.19,0.19,0.19,0.19,0.19,0.19,null,null,null,null,null,null,null,null,null,null,null,null,null,null,null,null,{"$f":"VLOOKUP(A105&D105&\"-\"&E105,ActiveFunds!$AH$4:$AI$787,2,0)","v":0}]
["195","","","501","1","195-Liquor and Cannabis Board",null,null,"501-1 Liquor Revolving Account-State",0.81,0.81,0.81,0.81,0.81,0.81,0.81,0.81,0.81,0.81,null,null,null,null,null,null,null,null,null,null,null,null,null,null,null,null,{"$f":"VLOOKUP(A106&D106&\"-\"&E106,ActiveFunds!$AH$4:$AI$787,2,0)","v":0}]
["205","","","025","6","205-Board of Pilotage Commissioners",null,null,"025-6 Pilotage Account-Non-Appropriated",1,1,1,1,1,1,1,1,1,1,null,null,null,null,null,null,null,null,null,null,null,null,null,null,null,null,{"$f":"VLOOKUP(A107&D107&\"-\"&E107,ActiveFunds!$AH$4:$AI$787,2,0)","v":1}]
["215","","","001","7","215-Utilities and Transportation Comm",null,null,"001-7 General Fund-Private/Local",0.06,0.06,0.06,0.06,0.06,0.06,0.06,0.06,0.06,0.06,null,null,null,null,null,null,null,null,null,null,null,null,null,null,null,null,{"$f":"VLOOKUP(A108&D108&\"-\"&E108,ActiveFunds!$AH$4:$AI$787,2,0)","v":0}]
["215","","","111","1","215-Utilities and Transportation Comm",null,null,"111-1 Public Service Revolving Account-State",0.87,0.87,0.87,0.87,0.87,0.87,0.87,0.87,0.87,0.87,null,null,null,null,null,null,null,null,null,null,null,null,null,null,null,null,{"$f":"VLOOKUP(A109&D109&\"-\"&E109,ActiveFunds!$AH$4:$AI$787,2,0)","v":0}]
["215","","","297","1","215-Utilities and Transportation Comm",null,null,"297-1 Pipeline Safety-State",7.0000000000000007E-2,7.0000000000000007E-2,7.0000000000000007E-2,7.0000000000000007E-2,7.0000000000000007E-2,7.0000000000000007E-2,7.0000000000000007E-2,7.0000000000000007E-2,7.0000000000000007E-2,7.0000000000000007E-2,null,null,null,null,null,null,null,null,null,null,null,null,null,null,null,null,{"$f":"VLOOKUP(A110&D110&\"-\"&E110,ActiveFunds!$AH$4:$AI$787,2,0)","v":0}]
["220","","","204","1","220-Board for Volunteer Firefighters",null,null,"204-1 Vol Firefight/Resv Officer Admin-State",1,1,1,1,1,1,1,1,1,1,null,null,null,null,null,null,null,null,null,null,null,null,null,null,null,null,{"$f":"VLOOKUP(A111&D111&\"-\"&E111,ActiveFunds!$AH$4:$AI$787,2,0)","v":0}]
["225","","","081","1","225-Washington State Patrol",null,null,"081-1 State Patrol Highway Account-State",0.8,0.8,0.8,0.8,0.8,0.8,0.8,0.8,0.8,0.8,null,null,null,null,null,null,null,null,null,null,null,null,null,null,null,null,{"$f":"VLOOKUP(A112&D112&\"-\"&E112,ActiveFunds!$AH$4:$AI$787,2,0)","v":1}]
["225","","","001","1","225-Washington State Patrol",null,null,"001-1 General Fund-State",0.2,0.2,0.2,0.2,0.2,0.2,0.2,0.2,0.2,0.2,null,null,null,null,null,null,null,null,null,null,null,null,null,null,null,null,{"$f":"VLOOKUP(A113&D113&\"-\"&E113,ActiveFunds!$AH$4:$AI$787,2,0)","v":0}]
[{"$f":"LEFT(F114,3)","v":"227"},{"$f":"IF(G114=\"\",\"\",LEFT(G114,3))","v":""},{"$f":"IF(H114=\"\",\"\",LEFT(H114,4))","v":""},{"$f":"LEFT(I114,3)","v":"001"},{"$f":"MID(I114,5,1)","v":"1"},"227-Criminal Justice Training Comm",null,null,"001-1 General Fund-State",1,1,1,1,1,1,1,1,1,1,null,null,null,null,null,null,null,null,null,null,null,null,null,null,null,null,{"$f":"VLOOKUP(A114&D114&\"-\"&E114,ActiveFunds!$AH$4:$AI$787,2,0)","v":0}]
["228","","","106","1","228-WA Traffic Safety Commission",null,null,"106-1 Highway Safety Account-State",1,1,1,1,0.5,1,0.15,0.5,0.5,0.5,null,null,null,null,null,null,null,null,null,null,null,null,null,null,null,null,{"$f":"VLOOKUP(A115&D115&\"-\"&E115,ActiveFunds!$AH$4:$AI$787,2,0)","v":1}]
["228","","","106","2","228-WA Traffic Safety Commission",null,null,"106-2 Highway Safety Account-Federal",0,0,0,0,0.5,0,0.85,0.5,0.5,0.5,null,null,null,null,null,null,null,null,null,null,null,null,null,null,null,null,{"$f":"VLOOKUP(A116&D116&\"-\"&E116,ActiveFunds!$AH$4:$AI$787,2,0)","v":1}]
["235","","","001","1","235-Department of Labor and Industries",null,null,"001-1 General Fund-State",5.0000000000000001E-3,1.2999999999999999E-2,0.20499999999999999,2.5000000000000001E-2,0.01,0.01,0.01,0.01,0.01,0.01,null,null,null,null,null,null,null,null,null,null,null,null,null,null,null,null,{"$f":"VLOOKUP(A117&D117&\"-\"&E117,ActiveFunds!$AH$4:$AI$787,2,0)","v":0}]
["235","","","095","1","235-Department of Labor and Industries",null,null,"095-1 Electrical License Account-State",8.0000000000000002E-3,1.0999999999999999E-2,0.28199999999999997,1.7999999999999999E-2,0.01,0.01,0.01,0.01,0.01,0.01,null,null,null,null,null,null,null,null,null,null,null,null,null,null,null,null,{"$f":"VLOOKUP(A118&D118&\"-\"&E118,ActiveFunds!$AH$4:$AI$787,2,0)","v":0}]
["235","","","234","1","235-Department of Labor and Industries",null,null,"234-1 Public Works Administration Acct-State",2E-3,5.0000000000000001E-3,3.0000000000000001E-3,7.0000000000000001E-3,0,0,0,0,0,0,null,null,null,null,null,null,null,null,null,null,null,null,null,null,null,null,{"$f":"VLOOKUP(A119&D119&\"-\"&E119,ActiveFunds!$AH$4:$AI$787,2,0)","v":0}]
["235","","","608","1","235-Department of Labor and Industries",null,null,"608-1 Accident Account-State",0.49399999999999999,0.52100000000000002,0.38800000000000001,0.45600000000000002,0.52,0.52,0.52,0.52,0.52,0.52,null,null,null,null,null,null,null,null,null,null,null,null,null,null,null,null,{"$f":"VLOOKUP(A120&D120&\"-\"&E120,ActiveFunds!$AH$4:$AI$787,2,0)","v":0}]
["235","","","609","1","235-Department of Labor and Industries",null,null,"609-1 Medical Aid Account-State",0.48899999999999999,0.45,6.8000000000000005E-2,0.48799999999999999,0.46,0.46,0.46,0.46,0.46,0.46,null,null,null,null,null,null,null,null,null,null,null,null,null,null,null,null,{"$f":"VLOOKUP(A121&D121&\"-\"&E121,ActiveFunds!$AH$4:$AI$787,2,0)","v":0}]
["235","","","885","1","235-Department of Labor and Industries",null,null,"885-1 Plumbing Certificate Account-State",0,0,5.3999999999999999E-2,1E-3,0,0,0,0,0,0,null,null,null,null,null,null,null,null,null,null,null,null,null,null,null,null,{"$f":"VLOOKUP(A122&D122&\"-\"&E122,ActiveFunds!$AH$4:$AI$787,2,0)","v":0}]
["235","","","892","1","235-Department of Labor and Industries",null,null,"892-1 Pressure Systems Safety Account-State",2E-3,0,0,5.0000000000000001E-3,0,0,0,0,0,0,null,null,null,null,null,null,null,null,null,null,null,null,null,null,null,null,{"$f":"VLOOKUP(A123&D123&\"-\"&E123,ActiveFunds!$AH$4:$AI$787,2,0)","v":0}]
["240","","","001","1","240-Department of Licensing",null,null,"001-1 General Fund-State",0,1.43E-2,0,9.5999999999999992E-3,8.5000000000000006E-3,5.4999999999999997E-3,8.5000000000000006E-3,4.7999999999999996E-3,4.7999999999999996E-3,4.7999999999999996E-3,null,null,null,null,null,null,null,null,null,null,null,null,null,null,null,null,{"$f":"VLOOKUP(A124&D124&\"-\"&E124,ActiveFunds!$AH$4:$AI$787,2,0)","v":0}]
["240","","","003","1","240-Department of Licensing",null,null,"003-1 Architects' License Account-State",0,6.1999999999999998E-3,0,4.0000000000000001E-3,2E-3,1.1999999999999999E-3,3.2000000000000002E-3,8.9999999999999998E-4,8.9999999999999998E-4,8.9999999999999998E-4,null,null,null,null,null,null,null,null,null,null,null,null,null,null,null,null,{"$f":"VLOOKUP(A125&D125&\"-\"&E125,ActiveFunds!$AH$4:$AI$787,2,0)","v":0}]
["240","","","024","1","240-Department of Licensing",null,null,"024-1 Professional Engineers' Account-State",0,2.0500000000000001E-2,0,1.6400000000000001E-2,8.3000000000000001E-3,6.7000000000000002E-3,1.32E-2,5.1000000000000004E-3,5.1000000000000004E-3,5.1000000000000004E-3,null,null,null,null,null,null,null,null,null,null,null,null,null,null,null,null,{"$f":"VLOOKUP(A126&D126&\"-\"&E126,ActiveFunds!$AH$4:$AI$787,2,0)","v":0}]
["240","","","026","1","240-Department of Licensing",null,null,"026-1 Real Estate Commission Account-State",0,5.11E-2,0.30359999999999998,4.5600000000000002E-2,1.9599999999999999E-2,1.83E-2,3.6799999999999999E-2,1.3599999999999999E-2,1.3599999999999999E-2,1.3599999999999999E-2,null,null,null,null,null,null,null,null,null,null,null,null,null,null,null,null,{"$f":"VLOOKUP(A127&D127&\"-\"&E127,ActiveFunds!$AH$4:$AI$787,2,0)","v":0}]
["240","","","04E","1","240-Department of Licensing",null,null,"04E-1 Uniform Commercial Code Account-State",0,5.0000000000000001E-4,0,1.12E-2,1.6299999999999999E-2,7.4000000000000003E-3,8.6999999999999994E-3,6.4999999999999997E-3,6.4999999999999997E-3,6.4999999999999997E-3,null,null,null,null,null,null,null,null,null,null,null,null,null,null,null,null,{"$f":"VLOOKUP(A128&D128&\"-\"&E128,ActiveFunds!$AH$4:$AI$787,2,0)","v":0}]
["240","","","06G","1","240-Department of Licensing",null,null,"06G-1 Real Estate Appraiser Comm Acct-State",0,1.2E-2,3.8600000000000002E-2,7.3000000000000001E-3,2E-3,2.8E-3,5.8999999999999999E-3,2E-3,2E-3,2E-3,null,null,null,null,null,null,null,null,null,null,null,null,null,null,null,null,{"$f":"VLOOKUP(A129&D129&\"-\"&E129,ActiveFunds!$AH$4:$AI$787,2,0)","v":0}]
["240","","","06L","1","240-Department of Licensing",null,null,"06L-1 Business & Professions Account-State",0.17899999999999999,7.0099999999999996E-2,0.26429999999999998,7.2700000000000001E-2,3.5999999999999997E-2,4.02E-2,5.8500000000000003E-2,2.5100000000000001E-2,2.5100000000000001E-2,2.5100000000000001E-2,null,null,null,null,null,null,null,null,null,null,null,null,null,null,null,null,{"$f":"VLOOKUP(A130&D130&\"-\"&E130,ActiveFunds!$AH$4:$AI$787,2,0)","v":0}]
["240","","","082","1","240-Department of Licensing",null,null,"082-1 Motorcycle Safety Education Account-State",0,0,0,1.7299999999999999E-2,2.0999999999999999E-3,7.4999999999999997E-3,1.43E-2,2.87E-2,2.87E-2,2.87E-2,null,null,null,null,null,null,null,null,null,null,null,null,null,null,null,null,{"$f":"VLOOKUP(A131&D131&\"-\"&E131,ActiveFunds!$AH$4:$AI$787,2,0)","v":1}]
["240","","","104","1","240-Department of Licensing",null,null,"104-1 State Wildlife Account-State",0,0,0,3.8999999999999998E-3,1.6000000000000001E-3,5.7000000000000002E-3,3.0999999999999999E-3,6.4000000000000003E-3,6.4000000000000003E-3,6.4000000000000003E-3,null,null,null,null,null,null,null,null,null,null,null,null,null,null,null,null,{"$f":"VLOOKUP(A132&D132&\"-\"&E132,ActiveFunds!$AH$4:$AI$787,2,0)","v":1}]
["240","","","106","1","240-Department of Licensing",null,null,"106-1 Highway Safety Account-State",0.79169999999999996,0.50429999999999997,4.7999999999999996E-3,0.47989999999999999,0.44490000000000002,0.5474,0.58350000000000002,0.60399999999999998,0.60399999999999998,0.60399999999999998,null,null,null,null,null,null,null,null,null,null,null,null,null,null,null,null,{"$f":"VLOOKUP(A133&D133&\"-\"&E133,ActiveFunds!$AH$4:$AI$787,2,0)","v":1}]
["240","","","108","1","240-Department of Licensing",null,null,"108-1 Motor Vehicle Account-State",2.93E-2,0.25940000000000002,0.37709999999999999,0.2994,0.36969999999999997,0.34370000000000001,0.25580000000000003,0.28899999999999998,0.28899999999999998,0.28899999999999998,null,null,null,null,null,null,null,null,null,null,null,null,null,null,null,null,{"$f":"VLOOKUP(A134&D134&\"-\"&E134,ActiveFunds!$AH$4:$AI$787,2,0)","v":1}]
["240","","","15V","6","240-Department of Licensing",null,null,"15V-6 Funeral and Cemetery Account-Non-Appropriated",0,5.3400000000000003E-2,4.1000000000000003E-3,6.4000000000000003E-3,2.3999999999999998E-3,1.6999999999999999E-3,5.1999999999999998E-3,1.1999999999999999E-3,1.1999999999999999E-3,1.1999999999999999E-3,null,null,null,null,null,null,null,null,null,null,null,null,null,null,null,null,{"$f":"VLOOKUP(A135&D135&\"-\"&E135,ActiveFunds!$AH$4:$AI$787,2,0)","v":0}]
["240","","","16B","6","240-Department of Licensing",null,null,"16B-6 Landscape Architects' License Acct-Non-Appropriated",0,5.0000000000000001E-4,0,1.6000000000000001E-3,2.0000000000000001E-4,5.0000000000000001E-4,1.2999999999999999E-3,0,0,0,null,null,null,null,null,null,null,null,null,null,null,null,null,null,null,null,{"$f":"VLOOKUP(A136&D136&\"-\"&E136,ActiveFunds!$AH$4:$AI$787,2,0)","v":0}]
["240","","","16M","6","240-Department of Licensing",null,null,"16M-6 Appraisal Management Company Acct-Non-Appropriated",0,2.5000000000000001E-3,7.4999999999999997E-3,6.9999999999999999E-4,1E-4,2.0000000000000001E-4,0,0,0,0,null,null,null,null,null,null,null,null,null,null,null,null,null,null,null,null,{"$f":"VLOOKUP(A137&D137&\"-\"&E137,ActiveFunds!$AH$4:$AI$787,2,0)","v":0}]
["240","","","201","1","240-Department of Licensing",null,null,"201-1 DOL Services Account-State",0,0,0,1.9599999999999999E-2,8.1500000000000003E-2,7.6E-3,0,1.2E-2,1.2E-2,1.2E-2,null,null,null,null,null,null,null,null,null,null,null,null,null,null,null,null,{"$f":"VLOOKUP(A138&D138&\"-\"&E138,ActiveFunds!$AH$4:$AI$787,2,0)","v":1}]
["240","","","298","6","240-Department of Licensing",null,null,"298-6 Geologists' Account-Non-Appropriated",0,5.1999999999999998E-3,0,2.5000000000000001E-3,6.9999999999999999E-4,8.9999999999999998E-4,2E-3,6.9999999999999999E-4,6.9999999999999999E-4,6.9999999999999999E-4,null,null,null,null,null,null,null,null,null,null,null,null,null,null,null,null,{"$f":"VLOOKUP(A139&D139&\"-\"&E139,ActiveFunds!$AH$4:$AI$787,2,0)","v":0}]
["240","","","14V","1","240-Department of Licensing",null,null,"14V-1 Ignition Interlock Device Revolving-State",0,0,0,1.9E-3,4.1000000000000003E-3,2.7000000000000001E-3,0,0,0,0,null,null,null,null,null,null,null,null,null,null,null,null,null,null,null,null,{"$f":"VLOOKUP(A140&D140&\"-\"&E140,ActiveFunds!$AH$4:$AI$787,2,0)","v":1}]
["245","","","001","1","245-Military Department",null,null,"001-1 General Fund-State",1,1,1,1,1,1,1,1,1,1,null,null,null,null,null,null,null,null,null,null,null,null,null,null,null,null,{"$f":"VLOOKUP(A141&D141&\"-\"&E141,ActiveFunds!$AH$4:$AI$787,2,0)","v":0}]
[{"$f":"LEFT(F142,3)","v":"275"},{"$f":"IF(G142=\"\",\"\",LEFT(G142,3))","v":""},{"$f":"IF(H142=\"\",\"\",LEFT(H142,4))","v":""},{"$f":"LEFT(I142,3)","v":"001"},{"$f":"MID(I142,5,1)","v":"1"},"275-Public Employment Relations Comm",null,null,"001-1 General Fund-State",0.51339999999999997,0.51339999999999997,0.51339999999999997,0.51339999999999997,0.51339999999999997,0.51339999999999997,0.51339999999999997,0.51339999999999997,0.51339999999999997,0.51339999999999997,null,null,null,null,null,null,null,null,null,null,null,null,null,null,null,null,{"$f":"VLOOKUP(A142&D142&\"-\"&E142,ActiveFunds!$AH$4:$AI$787,2,0)","v":0}]
[{"$f":"LEFT(F143,3)","v":"275"},{"$f":"IF(G143=\"\",\"\",LEFT(G143,3))","v":""},{"$f":"IF(H143=\"\",\"\",LEFT(H143,4))","v":""},{"$f":"LEFT(I143,3)","v":"415"},{"$f":"MID(I143,5,1)","v":"1"},"275-Public Employment Relations Comm",null,null,"415-1 Personnel Service Account-State",0.42059999999999997,0.42059999999999997,0.42059999999999997,0.42059999999999997,0.42059999999999997,0.42059999999999997,0.42059999999999997,0.42059999999999997,0.42059999999999997,0.42059999999999997,null,null,null,null,null,null,null,null,null,null,null,null,null,null,null,null,{"$f":"VLOOKUP(A143&D143&\"-\"&E143,ActiveFunds!$AH$4:$AI$787,2,0)","v":0}]
[{"$f":"LEFT(F144,3)","v":"275"},{"$f":"IF(G144=\"\",\"\",LEFT(G144,3))","v":""},{"$f":"IF(H144=\"\",\"\",LEFT(H144,4))","v":""},{"$f":"LEFT(I144,3)","v":"455"},{"$f":"MID(I144,5,1)","v":"1"},"275-Public Employment Relations Comm",null,null,"455-1 Higher Education Personnel Services-State",6.6000000000000003E-2,6.6000000000000003E-2,6.6000000000000003E-2,6.6000000000000003E-2,6.6000000000000003E-2,6.6000000000000003E-2,6.6000000000000003E-2,6.6000000000000003E-2,6.6000000000000003E-2,6.6000000000000003E-2,null,null,null,null,null,null,null,null,null,null,null,null,null,null,null,null,{"$f":"VLOOKUP(A144&D144&\"-\"&E144,ActiveFunds!$AH$4:$AI$787,2,0)","v":0}]
["300","010","","001","1","300-Dept of Social and Health Services","010-Children & Family Services",null,"001-1 General Fund-State",0,0,0,0,0,0,2.9600000000000001E-2,0,0,0,null,null,null,null,null,null,null,null,null,null,null,null,null,null,null,null,{"$f":"VLOOKUP(A145&D145&\"-\"&E145,ActiveFunds!$AH$4:$AI$787,2,0)","v":0}]
["300","010","","001","2","300-Dept of Social and Health Services","010-Children & Family Services",null,"001-2 General Fund-Federal",0,0,0,0,0,0,6.9999999999999999E-4,0,0,0,null,null,null,null,null,null,null,null,null,null,null,null,null,null,null,null,{"$f":"VLOOKUP(A146&D146&\"-\"&E146,ActiveFunds!$AH$4:$AI$787,2,0)","v":0}]
["300","020","","001","1","300-Dept of Social and Health Services","020-Juvenile Rehabilitation",null,"001-1 General Fund-State",0,0,0,0,0,0,4.41E-2,0,0,0,null,null,null,null,null,null,null,null,null,null,null,null,null,null,null,null,{"$f":"VLOOKUP(A147&D147&\"-\"&E147,ActiveFunds!$AH$4:$AI$787,2,0)","v":0}]
["300","020","","001","2","300-Dept of Social and Health Services","020-Juvenile Rehabilitation",null,"001-2 General Fund-Federal",0,0,0,0,0,0,0,0,0,0,null,null,null,null,null,null,null,null,null,null,null,null,null,null,null,null,{"$f":"VLOOKUP(A148&D148&\"-\"&E148,ActiveFunds!$AH$4:$AI$787,2,0)","v":0}]
["300","030","1000","001","1","300-Dept of Social and Health Services","030-Mental Health","1000-Community Services/RSN             ","001-1 General Fund-State",0,0,0,0,0,0,4.0000000000000002E-4,0,0,0,null,null,null,null,null,null,null,null,null,null,null,null,null,null,null,null,{"$f":"VLOOKUP(A149&D149&\"-\"&E149,ActiveFunds!$AH$4:$AI$787,2,0)","v":0}]
["300","030","1000","001","2","300-Dept of Social and Health Services","030-Mental Health","1000-Community Services/RSN             ","001-2 General Fund-Federal",0,0,0,0,0,0,0,0,0,0,null,null,null,null,null,null,null,null,null,null,null,null,null,null,null,null,{"$f":"VLOOKUP(A150&D150&\"-\"&E150,ActiveFunds!$AH$4:$AI$787,2,0)","v":0}]
["300","030","2000","001","1","300-Dept of Social and Health Services","030-Mental Health","2000-State Facility Services            ","001-1 General Fund-State",0,0,0,0,0,0,0.3881,0,0,0,null,null,null,null,null,null,null,null,null,null,null,null,null,null,null,null,{"$f":"VLOOKUP(A151&D151&\"-\"&E151,ActiveFunds!$AH$4:$AI$787,2,0)","v":0}]
["300","030","2000","001","2","300-Dept of Social and Health Services","030-Mental Health","2000-State Facility Services            ","001-2 General Fund-Federal",0,0,0,0,0,0,2.87E-2,0,0,0,null,null,null,null,null,null,null,null,null,null,null,null,null,null,null,null,{"$f":"VLOOKUP(A152&D152&\"-\"&E152,ActiveFunds!$AH$4:$AI$787,2,0)","v":0}]
["300","030","8000","001","1","300-Dept of Social and Health Services","030-Mental Health","8000-Special Projects                   ","001-1 General Fund-State",0,0,0,0,0,0,1E-4,0,0,0,null,null,null,null,null,null,null,null,null,null,null,null,null,null,null,null,{"$f":"VLOOKUP(A153&D153&\"-\"&E153,ActiveFunds!$AH$4:$AI$787,2,0)","v":0}]
["300","030","8000","001","2","300-Dept of Social and Health Services","030-Mental Health","8000-Special Projects                   ","001-2 General Fund-Federal",0,0,0,0,0,0,0,0,0,0,null,null,null,null,null,null,null,null,null,null,null,null,null,null,null,null,{"$f":"VLOOKUP(A154&D154&\"-\"&E154,ActiveFunds!$AH$4:$AI$787,2,0)","v":0}]
["300","030","9000","001","1","300-Dept of Social and Health Services","030-Mental Health","9000-Program Support                    ","001-1 General Fund-State",0,0,0,0,0,0,8.9999999999999998E-4,0,0,0,null,null,null,null,null,null,null,null,null,null,null,null,null,null,null,null,{"$f":"VLOOKUP(A155&D155&\"-\"&E155,ActiveFunds!$AH$4:$AI$787,2,0)","v":0}]
["300","030","9000","001","2","300-Dept of Social and Health Services","030-Mental Health","9000-Program Support                    ","001-2 General Fund-Federal",0,0,0,0,0,0,1E-4,0,0,0,null,null,null,null,null,null,null,null,null,null,null,null,null,null,null,null,{"$f":"VLOOKUP(A156&D156&\"-\"&E156,ActiveFunds!$AH$4:$AI$787,2,0)","v":0}]
["300","040","1000","001","1","300-Dept of Social and Health Services","040-Developmental Disabilities","1000-Community Services                 ","001-1 General Fund-State",0,0,0,0,0,0,3.1199999999999999E-2,0,0,0,null,null,null,null,null,null,null,null,null,null,null,null,null,null,null,null,{"$f":"VLOOKUP(A157&D157&\"-\"&E157,ActiveFunds!$AH$4:$AI$787,2,0)","v":0}]
["300","040","1000","001","2","300-Dept of Social and Health Services","040-Developmental Disabilities","1000-Community Services                 ","001-2 General Fund-Federal",0,0,0,0,0,0,2.9700000000000001E-2,0,0,0,null,null,null,null,null,null,null,null,null,null,null,null,null,null,null,null,{"$f":"VLOOKUP(A158&D158&\"-\"&E158,ActiveFunds!$AH$4:$AI$787,2,0)","v":0}]
["300","040","2000","001","1","300-Dept of Social and Health Services","040-Developmental Disabilities","2000-Residential Habilitation Services  ","001-1 General Fund-State",0,0,0,0,0,0,0.1694,0,0,0,null,null,null,null,null,null,null,null,null,null,null,null,null,null,null,null,{"$f":"VLOOKUP(A159&D159&\"-\"&E159,ActiveFunds!$AH$4:$AI$787,2,0)","v":0}]
["300","040","2000","001","2","300-Dept of Social and Health Services","040-Developmental Disabilities","2000-Residential Habilitation Services  ","001-2 General Fund-Federal",0,0,0,0,0,0,0.16159999999999999,0,0,0,null,null,null,null,null,null,null,null,null,null,null,null,null,null,null,null,{"$f":"VLOOKUP(A160&D160&\"-\"&E160,ActiveFunds!$AH$4:$AI$787,2,0)","v":0}]
["300","040","8000","001","1","300-Dept of Social and Health Services","040-Developmental Disabilities","8000-Special Projects                   ","001-1 General Fund-State",0,0,0,0,0,0,0,0,0,0,null,null,null,null,null,null,null,null,null,null,null,null,null,null,null,null,{"$f":"VLOOKUP(A161&D161&\"-\"&E161,ActiveFunds!$AH$4:$AI$787,2,0)","v":0}]
["300","040","8000","001","2","300-Dept of Social and Health Services","040-Developmental Disabilities","8000-Special Projects                   ","001-2 General Fund-Federal",0,0,0,0,0,0,0,0,0,0,null,null,null,null,null,null,null,null,null,null,null,null,null,null,null,null,{"$f":"VLOOKUP(A162&D162&\"-\"&E162,ActiveFunds!$AH$4:$AI$787,2,0)","v":0}]
["300","040","9000","001","1","300-Dept of Social and Health Services","040-Developmental Disabilities","9000-Program Support                    ","001-1 General Fund-State",0,0,0,0,0,0,1E-4,0,0,0,null,null,null,null,null,null,null,null,null,null,null,null,null,null,null,null,{"$f":"VLOOKUP(A163&D163&\"-\"&E163,ActiveFunds!$AH$4:$AI$787,2,0)","v":0}]
["300","040","9000","001","2","300-Dept of Social and Health Services","040-Developmental Disabilities","9000-Program Support                    ","001-2 General Fund-Federal",0,0,0,0,0,0,1E-4,0,0,0,null,null,null,null,null,null,null,null,null,null,null,null,null,null,null,null,{"$f":"VLOOKUP(A164&D164&\"-\"&E164,ActiveFunds!$AH$4:$AI$787,2,0)","v":0}]
["300","050","","001","1","300-Dept of Social and Health Services","050-Long-Term Care Services",null,"001-1 General Fund-State",0,0,0,0,0,0,1.0500000000000001E-2,0,0,0,null,null,null,null,null,null,null,null,null,null,null,null,null,null,null,null,{"$f":"VLOOKUP(A165&D165&\"-\"&E165,ActiveFunds!$AH$4:$AI$787,2,0)","v":0}]
["300","050","","001","2","300-Dept of Social and Health Services","050-Long-Term Care Services",null,"001-2 General Fund-Federal",0,0,0,0,0,0,9.7000000000000003E-3,0,0,0,null,null,null,null,null,null,null,null,null,null,null,null,null,null,null,null,{"$f":"VLOOKUP(A166&D166&\"-\"&E166,ActiveFunds!$AH$4:$AI$787,2,0)","v":0}]
["300","060","","001","1","300-Dept of Social and Health Services","060-Economic Services Administration",null,"001-1 General Fund-State",0,0,0,0,0,0,3.6600000000000001E-2,0,0,0,null,null,null,null,null,null,null,null,null,null,null,null,null,null,null,null,{"$f":"VLOOKUP(A167&D167&\"-\"&E167,ActiveFunds!$AH$4:$AI$787,2,0)","v":0}]
["300","060","","001","2","300-Dept of Social and Health Services","060-Economic Services Administration",null,"001-2 General Fund-Federal",0,0,0,0,0,0,1.9800000000000002E-2,0,0,0,null,null,null,null,null,null,null,null,null,null,null,null,null,null,null,null,{"$f":"VLOOKUP(A168&D168&\"-\"&E168,ActiveFunds!$AH$4:$AI$787,2,0)","v":0}]
["300","070","","001","1","300-Dept of Social and Health Services","070-Alcohol & Substance Abuse",null,"001-1 General Fund-State",0,0,0,0,0,0,6.9999999999999999E-4,0,0,0,null,null,null,null,null,null,null,null,null,null,null,null,null,null,null,null,{"$f":"VLOOKUP(A169&D169&\"-\"&E169,ActiveFunds!$AH$4:$AI$787,2,0)","v":0}]
["300","070","","001","2","300-Dept of Social and Health Services","070-Alcohol & Substance Abuse",null,"001-2 General Fund-Federal",0,0,0,0,0,0,2.0000000000000001E-4,0,0,0,null,null,null,null,null,null,null,null,null,null,null,null,null,null,null,null,{"$f":"VLOOKUP(A170&D170&\"-\"&E170,ActiveFunds!$AH$4:$AI$787,2,0)","v":0}]
["300","100","","001","1","300-Dept of Social and Health Services","100-Vocational Rehabilitation",null,"001-1 General Fund-State",0,0,0,0,0,0,3.8E-3,0,0,0,null,null,null,null,null,null,null,null,null,null,null,null,null,null,null,null,{"$f":"VLOOKUP(A171&D171&\"-\"&E171,ActiveFunds!$AH$4:$AI$787,2,0)","v":0}]
["300","100","","001","2","300-Dept of Social and Health Services","100-Vocational Rehabilitation",null,"001-2 General Fund-Federal",0,0,0,0,0,0,0,0,0,0,null,null,null,null,null,null,null,null,null,null,null,null,null,null,null,null,{"$f":"VLOOKUP(A172&D172&\"-\"&E172,ActiveFunds!$AH$4:$AI$787,2,0)","v":0}]
["300","110","","001","1","300-Dept of Social and Health Services","110-Administration & Supporting Services",null,"001-1 General Fund-State",0,0,0,0,0,0,7.1999999999999998E-3,0,0,0,null,null,null,null,null,null,null,null,null,null,null,null,null,null,null,null,{"$f":"VLOOKUP(A173&D173&\"-\"&E173,ActiveFunds!$AH$4:$AI$787,2,0)","v":0}]
["300","110","","001","2","300-Dept of Social and Health Services","110-Administration & Supporting Services",null,"001-2 General Fund-Federal",0,0,0,0,0,0,1.6000000000000001E-3,0,0,0,null,null,null,null,null,null,null,null,null,null,null,null,null,null,null,null,{"$f":"VLOOKUP(A174&D174&\"-\"&E174,ActiveFunds!$AH$4:$AI$787,2,0)","v":0}]
["300","135","","001","1","300-Dept of Social and Health Services","135-Special Commitment Center",null,"001-1 General Fund-State",0,0,0,0,0,0,2.5100000000000001E-2,0,0,0,null,null,null,null,null,null,null,null,null,null,null,null,null,null,null,null,{"$f":"VLOOKUP(A175&D175&\"-\"&E175,ActiveFunds!$AH$4:$AI$787,2,0)","v":0}]
["300","145","","001","1","300-Dept of Social and Health Services","145-Payments to Other Agencies",null,"001-1 General Fund-State",0.63590000000000002,0.70269999999999999,0.43840000000000001,0.70479999999999998,0.69279999999999997,1,0,0.69899999999999995,0.69899999999999995,0.69899999999999995,null,null,null,null,null,null,null,null,null,null,null,null,null,null,null,null,{"$f":"VLOOKUP(A176&D176&\"-\"&E176,ActiveFunds!$AH$4:$AI$787,2,0)","v":0}]
["300","145","","001","2","300-Dept of Social and Health Services","145-Payments to Other Agencies",null,"001-2 General Fund-Federal",0.36409999999999998,0.29730000000000001,0.56159999999999999,0.29520000000000002,0.30719999999999997,0,0,0.30099999999999999,0.30099999999999999,0.30099999999999999,null,null,null,null,null,null,null,null,null,null,null,null,null,null,null,null,{"$f":"VLOOKUP(A177&D177&\"-\"&E177,ActiveFunds!$AH$4:$AI$787,2,0)","v":0}]
["300","150","","001","1","300-Dept of Social and Health Services","150-Information System Services",null,"001-1 General Fund-State",0,0,0,0,0,0,0,0,0,0,null,null,null,null,null,null,null,null,null,null,null,null,null,null,null,null,{"$f":"VLOOKUP(A178&D178&\"-\"&E178,ActiveFunds!$AH$4:$AI$787,2,0)","v":0}]
["300","150","","001","2","300-Dept of Social and Health Services","150-Information System Services",null,"001-2 General Fund-Federal",0,0,0,0,0,0,0,0,0,0,null,null,null,null,null,null,null,null,null,null,null,null,null,null,null,null,{"$f":"VLOOKUP(A179&D179&\"-\"&E179,ActiveFunds!$AH$4:$AI$787,2,0)","v":0}]
["300","160","","001","1","300-Dept of Social and Health Services","160-Consolidated Field Services",null,"001-1 General Fund-State",0,0,0,0,0,0,0,0,0,0,null,null,null,null,null,null,null,null,null,null,null,null,null,null,null,null,{"$f":"VLOOKUP(A180&D180&\"-\"&E180,ActiveFunds!$AH$4:$AI$787,2,0)","v":0}]
["300","160","","001","2","300-Dept of Social and Health Services","160-Consolidated Field Services",null,"001-2 General Fund-Federal",0,0,0,0,0,0,0,0,0,0,null,null,null,null,null,null,null,null,null,null,null,null,null,null,null,null,{"$f":"VLOOKUP(A181&D181&\"-\"&E181,ActiveFunds!$AH$4:$AI$787,2,0)","v":0}]
[{"$f":"LEFT(F182,3)","v":"303"},{"$f":"IF(G182=\"\",\"\",LEFT(G182,3))","v":""},{"$f":"IF(H182=\"\",\"\",LEFT(H182,4))","v":""},{"$f":"LEFT(I182,3)","v":"001"},{"$f":"MID(I182,5,1)","v":"1"},"303-Department of Health",null,null,"001-1 General Fund-State",0.16,8.2000000000000003E-2,8.2000000000000003E-2,0.11799999999999999,0.16,0.3,0.25700000000000001,0.16,0.16,0.16,null,null,null,null,null,null,null,null,null,null,null,null,null,null,null,null,{"$f":"VLOOKUP(A182&D182&\"-\"&E182,ActiveFunds!$AH$4:$AI$787,2,0)","v":0}]
["303","","","001","2","303-Department of Health",null,null,"001-2 General Fund-Federal",0.36599999999999999,0.05,0.05,0.157,0.36599999999999999,0,0.26500000000000001,0.36599999999999999,0.36599999999999999,0.36599999999999999,null,null,null,null,null,null,null,null,null,null,null,null,null,null,null,null,{"$f":"VLOOKUP(A183&D183&\"-\"&E183,ActiveFunds!$AH$4:$AI$787,2,0)","v":0}]
["303","","","001","7","303-Department of Health",null,null,"001-7 General Fund-Private/Local",0.13700000000000001,0.09,0.09,0.115,0.13700000000000001,0.38700000000000001,0.14199999999999999,0.13700000000000001,0.13700000000000001,0.13700000000000001,null,null,null,null,null,null,null,null,null,null,null,null,null,null,null,null,{"$f":"VLOOKUP(A184&D184&\"-\"&E184,ActiveFunds!$AH$4:$AI$787,2,0)","v":0}]
["303","","","02G","1","303-Department of Health",null,null,"02G-1 Health Professions Account-State",0.28199999999999997,0.76800000000000002,0.76800000000000002,0.58299999999999996,0.28199999999999997,0.31,0.18099999999999999,0.28199999999999997,0.28199999999999997,0.28199999999999997,null,null,null,null,null,null,null,null,null,null,null,null,null,null,null,null,{"$f":"VLOOKUP(A185&D185&\"-\"&E185,ActiveFunds!$AH$4:$AI$787,2,0)","v":0}]
["303","","","03R","1","303-Department of Health",null,null,"03R-1 Safe Drinking Water Account-State",1.4999999999999999E-2,0.01,0.01,1.2E-2,1.4999999999999999E-2,3.0000000000000001E-3,1.4999999999999999E-2,1.4999999999999999E-2,1.4999999999999999E-2,1.4999999999999999E-2,null,null,null,null,null,null,null,null,null,null,null,null,null,null,null,null,{"$f":"VLOOKUP(A186&D186&\"-\"&E186,ActiveFunds!$AH$4:$AI$787,2,0)","v":0}]
["303","","","04R","2","303-Department of Health",null,null,"04R-2 Drinking Water Assistance Account-Federal",0.04,0,0,1.4999999999999999E-2,0.04,0,0.114,0.04,0.04,0.04,null,null,null,null,null,null,null,null,null,null,null,null,null,null,null,null,{"$f":"VLOOKUP(A187&D187&\"-\"&E187,ActiveFunds!$AH$4:$AI$787,2,0)","v":0}]
["303","","","173","1","303-Department of Health",null,null,"173-1 State Toxics Control Account-State",0,0,0,0,0,0,1.4999999999999999E-2,0,0,0,null,null,null,null,null,null,null,null,null,null,null,null,null,null,null,null,{"$f":"VLOOKUP(A188&D188&\"-\"&E188,ActiveFunds!$AH$4:$AI$787,2,0)","v":0}]
["303","","","15M","1","303-Department of Health",null,null,"15M-1 Biotoxin Account-State",0,0,0,0,0,0,1.0999999999999999E-2,0,0,0,null,null,null,null,null,null,null,null,null,null,null,null,null,null,null,null,{"$f":"VLOOKUP(A189&D189&\"-\"&E189,ActiveFunds!$AH$4:$AI$787,2,0)","v":0}]
["305","010","","001","1","305-Department of Veterans' Affairs","010-Headquarters",null,"001-1 General Fund-State",8.3500000000000005E-2,8.3000000000000004E-2,0,0.372,8.3500000000000005E-2,0.35,2E-3,8.3500000000000005E-2,2.2599999999999999E-2,1.38E-2,null,null,null,null,null,null,null,null,null,null,null,null,null,null,null,null,{"$f":"VLOOKUP(A190&D190&\"-\"&E190,ActiveFunds!$AH$4:$AI$787,2,0)","v":0}]
["305","020","","001","1","305-Department of Veterans' Affairs","020-Field Services",null,"001-1 General Fund-State",0.15509999999999999,0.15409999999999999,0,0.628,0.15509999999999999,0.65,1.35E-2,0.15509999999999999,4.1900000000000007E-2,2.5699999999999997E-2,null,null,null,null,null,null,null,null,null,null,null,null,null,null,null,null,{"$f":"VLOOKUP(A191&D191&\"-\"&E191,ActiveFunds!$AH$4:$AI$787,2,0)","v":0}]
["305","020","","001","2","305-Department of Veterans' Affairs","020-Field Services",null,"001-2 General Fund-Federal",0,0,0,0,0,0,3.8999999999999998E-3,0,0,0,null,null,null,null,null,null,null,null,null,null,null,null,null,null,null,null,{"$f":"VLOOKUP(A192&D192&\"-\"&E192,ActiveFunds!$AH$4:$AI$787,2,0)","v":0}]
["305","020","","001","7","305-Department of Veterans' Affairs","020-Field Services",null,"001-7 General Fund-Private/Local",0,0,0,0,0,0,3.0999999999999999E-3,0,0,0,null,null,null,null,null,null,null,null,null,null,null,null,null,null,null,null,{"$f":"VLOOKUP(A193&D193&\"-\"&E193,ActiveFunds!$AH$4:$AI$787,2,0)","v":0}]
["305","020","","08V","6","305-Department of Veterans' Affairs","020-Field Services",null,"08V-6 Stewardship Account",0,0,0,0,0,0,3.0999999999999999E-3,0,0,0,null,null,null,null,null,null,null,null,null,null,null,null,null,null,null,null,{"$f":"VLOOKUP(A194&D194&\"-\"&E194,ActiveFunds!$AH$4:$AI$787,2,0)","v":0}]
["305","020","","11V","7","305-Department of Veterans' Affairs","020-Field Services",null,"11V-7 Veterans Estate Mgmt Program",0,0,0,0,0,0,6.9999999999999999E-4,0,0,0,null,null,null,null,null,null,null,null,null,null,null,null,null,null,null,null,{"$f":"VLOOKUP(A195&D195&\"-\"&E195,ActiveFunds!$AH$4:$AI$787,2,0)","v":0}]
["305","035","","001","1","305-Department of Veterans' Affairs","035-Institutional Services",null,"001-1 General Fund-State",0.76139999999999997,0.76290000000000002,0,0,0.76139999999999997,0,0.97370000000000001,0.76139999999999997,0.9355,0.96050000000000002,null,null,null,null,null,null,null,null,null,null,null,null,null,null,null,null,{"$f":"VLOOKUP(A196&D196&\"-\"&E196,ActiveFunds!$AH$4:$AI$787,2,0)","v":0}]
["305","035","","001","2","305-Department of Veterans' Affairs","035-Institutional Services",null,"001-2 General Fund-Federal",0,0,0,0,0,0,0,0,0,0,null,null,null,null,null,null,null,null,null,null,null,null,null,null,null,null,{"$f":"VLOOKUP(A197&D197&\"-\"&E197,ActiveFunds!$AH$4:$AI$787,2,0)","v":0}]
["305","035","","001","7","305-Department of Veterans' Affairs","035-Institutional Services",null,"001-7 General Fund-Private/Local",0,0,0,0,0,0,0,0,0,0,null,null,null,null,null,null,null,null,null,null,null,null,null,null,null,null,{"$f":"VLOOKUP(A198&D198&\"-\"&E198,ActiveFunds!$AH$4:$AI$787,2,0)","v":0}]
["307","010","","001","1","307-Dept of Children, Youth & Families","010-Children and Family",null,"001-1 General Fund-State",0,0,0,0,0,0,0,0,0,0,null,null,null,null,null,null,null,null,null,null,null,null,null,null,null,null,{"$f":"VLOOKUP(A199&D199&\"-\"&E199,ActiveFunds!$AH$4:$AI$787,2,0)","v":{"$error":"#N/A"}}]
["307","020","","001","1","307-Dept of Children, Youth & Families","020-Juvenile Rehabilitation",null,"001-1 General Fund-State",0,0,0,0,0,0,0,0,0,0,null,null,null,null,null,null,null,null,null,null,null,null,null,null,null,null,{"$f":"VLOOKUP(A200&D200&\"-\"&E200,ActiveFunds!$AH$4:$AI$787,2,0)","v":{"$error":"#N/A"}}]
["307","030","","001","1","307-Dept of Children, Youth & Families","030-Early Learning",null,"001-1 General Fund-State",1,1,1,1,1,1,1,1,1,1,null,null,null,null,null,null,null,null,null,null,null,null,null,null,null,null,{"$f":"VLOOKUP(A201&D201&\"-\"&E201,ActiveFunds!$AH$4:$AI$787,2,0)","v":{"$error":"#N/A"}}]
["307","090","","001","1","307-Dept of Children, Youth & Families","090-Program Support",null,"001-1 General Fund-State",0,0,0,0,0,0,0,0,0,0,null,null,null,null,null,null,null,null,null,null,null,null,null,null,null,null,{"$f":"VLOOKUP(A202&D202&\"-\"&E202,ActiveFunds!$AH$4:$AI$787,2,0)","v":{"$error":"#N/A"}}]
["310","100","","001","1","310-Department of Corrections","100-Administration & Support Services",null,"001-1 General Fund-State",0,0,0,0,0,0,2.3400000000000001E-2,0,0,0,null,null,null,null,null,null,null,null,null,null,null,null,null,null,null,null,{"$f":"VLOOKUP(A203&D203&\"-\"&E203,ActiveFunds!$AH$4:$AI$787,2,0)","v":0}]
["310","200","","001","1","310-Department of Corrections","200-Correctional Operations",null,"001-1 General Fund-State",0,0,0,0,0,0,0.62890000000000001,0,0,0,null,null,null,null,null,null,null,null,null,null,null,null,null,null,null,null,{"$f":"VLOOKUP(A204&D204&\"-\"&E204,ActiveFunds!$AH$4:$AI$787,2,0)","v":0}]
["310","300","","001","1","310-Department of Corrections","300-Community Supervision",null,"001-1 General Fund-State",0,0,0,0,0,0,0.12909999999999999,0,0,0,null,null,null,null,null,null,null,null,null,null,null,null,null,null,null,null,{"$f":"VLOOKUP(A205&D205&\"-\"&E205,ActiveFunds!$AH$4:$AI$787,2,0)","v":0}]
["310","400","","001","1","310-Department of Corrections","400-Correctional Industries",null,"001-1 General Fund-State",0,0,0,0,0,0,9.5999999999999992E-3,0,0,0,null,null,null,null,null,null,null,null,null,null,null,null,null,null,null,null,{"$f":"VLOOKUP(A206&D206&\"-\"&E206,ActiveFunds!$AH$4:$AI$787,2,0)","v":0}]
["310","500","","001","1","310-Department of Corrections","500-Healthcare Services",null,"001-1 General Fund-State",0,0,0,0,0,0,0.1963,0,0,0,null,null,null,null,null,null,null,null,null,null,null,null,null,null,null,null,{"$f":"VLOOKUP(A207&D207&\"-\"&E207,ActiveFunds!$AH$4:$AI$787,2,0)","v":0}]
["310","600","","001","1","310-Department of Corrections","600-Interagency Payments",null,"001-1 General Fund-State",1,1,1,1,1,1,0,1,1,1,null,null,null,null,null,null,null,null,null,null,null,null,null,null,null,null,{"$f":"VLOOKUP(A208&D208&\"-\"&E208,ActiveFunds!$AH$4:$AI$787,2,0)","v":0}]
["310","700","","001","1","310-Department of Corrections","700-Offender Change",null,"001-1 General Fund-State",0,0,0,0,0,0,1.06E-2,0,0,0,null,null,null,null,null,null,null,null,null,null,null,null,null,null,null,null,{"$f":"VLOOKUP(A209&D209&\"-\"&E209,ActiveFunds!$AH$4:$AI$787,2,0)","v":0}]
["310","200","","11K","1","310-Department of Corrections","200-Correctional Operations",null,"11K-1 Washington Auto Theft Prevention-State",0,0,0,0,0,0,2E-3,0,0,0,null,null,null,null,null,null,null,null,null,null,null,null,null,null,null,null,{"$f":"VLOOKUP(A210&D210&\"-\"&E210,ActiveFunds!$AH$4:$AI$787,2,0)","v":0}]
["310","300","","206","6","310-Department of Corrections","300-Community Supervision",null,"206-6 Cost of Supervision Account-Non-Appropriated",0,0,0,0,0,0,1E-4,0,0,0,null,null,null,null,null,null,null,null,null,null,null,null,null,null,null,null,{"$f":"VLOOKUP(A211&D211&\"-\"&E211,ActiveFunds!$AH$4:$AI$787,2,0)","v":0}]
[{"$f":"LEFT(F212,3)","v":"315"},{"$f":"IF(G212=\"\",\"\",LEFT(G212,3))","v":""},{"$f":"IF(H212=\"\",\"\",LEFT(H212,4))","v":""},{"$f":"LEFT(I212,3)","v":"001"},{"$f":"MID(I212,5,1)","v":"1"},"315-Dept of Services for the Blind",null,null,"001-1 General Fund-State",0.19,0.19,0.19,0.19,0.19,0.94,0.19,0.19,0.19,0.19,null,null,null,null,null,null,null,null,null,null,null,null,null,null,null,null,{"$f":"VLOOKUP(A212&D212&\"-\"&E212,ActiveFunds!$AH$4:$AI$787,2,0)","v":0}]
["315","","","001","2","315-Dept of Services for the Blind",null,null,"001-2 General Fund-Federal",0.75,0.75,0.75,0.75,0.75,0,0.75,0.75,0.75,0.75,null,null,null,null,null,null,null,null,null,null,null,null,null,null,null,null,{"$f":"VLOOKUP(A213&D213&\"-\"&E213,ActiveFunds!$AH$4:$AI$787,2,0)","v":0}]
["315","","","02H","6","315-Dept of Services for the Blind",null,null,"02H-6 Business Enterprises Revolving Acct-Non-Appropriated",0.06,0.06,0.06,0.06,0.06,0.06,0.06,0.06,0.06,0.06,null,null,null,null,null,null,null,null,null,null,null,null,null,null,null,null,{"$f":"VLOOKUP(A214&D214&\"-\"&E214,ActiveFunds!$AH$4:$AI$787,2,0)","v":0}]
["340","PCA","","001","1","340-Student Achievement Council","PCA-Policy Coordination & Administration",null,"001-1 General Fund-State",0.45900000000000002,0.45900000000000002,0.45900000000000002,0.45900000000000002,0.45900000000000002,0.46899999999999997,0.45900000000000002,0.45900000000000002,0.45900000000000002,0.45900000000000002,null,null,null,null,null,null,null,null,null,null,null,null,null,null,null,null,{"$f":"VLOOKUP(A215&D215&\"-\"&E215,ActiveFunds!$AH$4:$AI$787,2,0)","v":0}]
["340","PCA","","001","2","340-Student Achievement Council","PCA-Policy Coordination & Administration",null,"001-2 General Fund-Federal",0.01,0.01,0.01,0.01,0.01,0,0.01,0.01,0.01,0.01,null,null,null,null,null,null,null,null,null,null,null,null,null,null,null,null,{"$f":"VLOOKUP(A216&D216&\"-\"&E216,ActiveFunds!$AH$4:$AI$787,2,0)","v":0}]
["340","SFA","","001","1","340-Student Achievement Council","SFA-Student Finanical Aid",null,"001-1 General Fund-State",1.2999999999999999E-2,1.2999999999999999E-2,1.2999999999999999E-2,1.2999999999999999E-2,1.2999999999999999E-2,9.5000000000000001E-2,1.2999999999999999E-2,1.2999999999999999E-2,1.2999999999999999E-2,1.2999999999999999E-2,null,null,null,null,null,null,null,null,null,null,null,null,null,null,null,null,{"$f":"VLOOKUP(A217&D217&\"-\"&E217,ActiveFunds!$AH$4:$AI$787,2,0)","v":0}]
["340","SFA","","001","2","340-Student Achievement Council","SFA-Student Finanical Aid",null,"001-2 General Fund-Federal",8.2000000000000003E-2,8.2000000000000003E-2,8.2000000000000003E-2,8.2000000000000003E-2,8.2000000000000003E-2,0,8.2000000000000003E-2,8.2000000000000003E-2,8.2000000000000003E-2,8.2000000000000003E-2,null,null,null,null,null,null,null,null,null,null,null,null,null,null,null,null,{"$f":"VLOOKUP(A218&D218&\"-\"&E218,ActiveFunds!$AH$4:$AI$787,2,0)","v":0}]
["340","SFA","","496","6","340-Student Achievement Council","SFA-Student Finanical Aid",null,"496-6 Future Teachers Condtnl Scholarship-Non-Appropriated",1.7000000000000001E-2,1.7000000000000001E-2,1.7000000000000001E-2,1.7000000000000001E-2,1.7000000000000001E-2,1.7000000000000001E-2,1.7000000000000001E-2,1.7000000000000001E-2,1.7000000000000001E-2,1.7000000000000001E-2,null,null,null,null,null,null,null,null,null,null,null,null,null,null,null,null,{"$f":"VLOOKUP(A219&D219&\"-\"&E219,ActiveFunds!$AH$4:$AI$787,2,0)","v":0}]
["340","SFA","","747","6","340-Student Achievement Council","SFA-Student Finanical Aid",null,"747-6 Health Prof Loan Repay/Scholar Prog-Non-Appropriated",3.5000000000000003E-2,3.5000000000000003E-2,3.5000000000000003E-2,3.5000000000000003E-2,3.5000000000000003E-2,3.5000000000000003E-2,3.5000000000000003E-2,3.5000000000000003E-2,3.5000000000000003E-2,3.5000000000000003E-2,null,null,null,null,null,null,null,null,null,null,null,null,null,null,null,null,{"$f":"VLOOKUP(A220&D220&\"-\"&E220,ActiveFunds!$AH$4:$AI$787,2,0)","v":0}]
["340","SFA","","788","6","340-Student Achievement Council","SFA-Student Finanical Aid",null,"788-6 Adv College Tuition Payment Pgm-Non-Appropriated",0.38400000000000001,0.38400000000000001,0.38400000000000001,0.38400000000000001,0.38400000000000001,0.38400000000000001,0.38400000000000001,0.38400000000000001,0.38400000000000001,0.38400000000000001,null,null,null,null,null,null,null,null,null,null,null,null,null,null,null,null,{"$f":"VLOOKUP(A221&D221&\"-\"&E221,ActiveFunds!$AH$4:$AI$787,2,0)","v":0}]
["341","","","548","6","341-LEOFF 2 Retirement Board",null,null,"548-6 LEOFF Plan 2 Expense Fund-Non-Appropriated",1,1,1,1,1,1,1,1,1,1,null,null,null,null,null,null,null,null,null,null,null,null,null,null,null,null,{"$f":"VLOOKUP(A222&D222&\"-\"&E222,ActiveFunds!$AH$4:$AI$787,2,0)","v":0}]
["350","010","","001","1","350-Public Schools","010-OSPI & Statewide Programs",null,"001-1 General Fund-State",1,1,1,1,1,1,1,1,1,1,null,null,null,null,null,null,null,null,null,null,null,null,null,null,null,null,{"$f":"VLOOKUP(A223&D223&\"-\"&E223,ActiveFunds!$AH$4:$AI$787,2,0)","v":0}]
["351","","","001","1","351-State School for the Blind",null,null,"001-1 General Fund-State",1,1,1,1,1,1,1,1,1,1,null,null,null,null,null,null,null,null,null,null,null,null,null,null,null,null,{"$f":"VLOOKUP(A224&D224&\"-\"&E224,ActiveFunds!$AH$4:$AI$787,2,0)","v":0}]
["353","","","001","1","353-Childhood Deafness & Hearing Loss",null,null,"001-1 General Fund-State",1,1,1,1,1,1,1,1,1,1,null,null,null,null,null,null,null,null,null,null,null,null,null,null,null,null,{"$f":"VLOOKUP(A225&D225&\"-\"&E225,ActiveFunds!$AH$4:$AI$787,2,0)","v":0}]
["354","","","001","1","354-Workforce Trng & Educ Coord Board",null,null,"001-1 General Fund-State",0.52,0.52,0.52,0.52,0.52,0.98,0.52,0.52,0.52,0.52,null,null,null,null,null,null,null,null,null,null,null,null,null,null,null,null,{"$f":"VLOOKUP(A226&D226&\"-\"&E226,ActiveFunds!$AH$4:$AI$787,2,0)","v":0}]
["354","","","001","2","354-Workforce Trng & Educ Coord Board",null,null,"001-2 General Fund-Federal",0.46,0.46,0.46,0.46,0.46,0,0.46,0.46,0.46,0.46,null,null,null,null,null,null,null,null,null,null,null,null,null,null,null,null,{"$f":"VLOOKUP(A227&D227&\"-\"&E227,ActiveFunds!$AH$4:$AI$787,2,0)","v":0}]
["354","","","503","6","354-Workforce Trng & Educ Coord Board",null,null,"503-6 Tuition Recovery Trust Fund-Non-Appropriated",0.02,0.02,0.02,0.02,0.02,0.02,0.02,0.02,0.02,0.02,null,null,null,null,null,null,null,null,null,null,null,null,null,null,null,null,{"$f":"VLOOKUP(A228&D228&\"-\"&E228,ActiveFunds!$AH$4:$AI$787,2,0)","v":0}]
["355","","","001","1","355-Archaeology & Historic Preservation",null,null,"001-1 General Fund-State",1,1,1,1,1,1,1,1,1,1,null,null,null,null,null,null,null,null,null,null,null,null,null,null,null,null,{"$f":"VLOOKUP(A229&D229&\"-\"&E229,ActiveFunds!$AH$4:$AI$787,2,0)","v":0}]
["357","","","001","1","357-Department of Early Learning",null,null,"001-1 General Fund-State",1,1,1,1,1,1,1,1,1,1,null,null,null,null,null,null,null,null,null,null,null,null,null,null,null,null,{"$f":"VLOOKUP(A230&D230&\"-\"&E230,ActiveFunds!$AH$4:$AI$787,2,0)","v":0}]
["359","","","17F","1","359-Washington Charter School Comm",null,null,"17F-1 WA Opportunity Pathways Account-State",1,1,1,1,1,1,1,1,1,1,null,null,null,null,null,null,null,null,null,null,null,null,null,null,null,null,{"$f":"VLOOKUP(A231&D231&\"-\"&E231,ActiveFunds!$AH$4:$AI$787,2,0)","v":0}]
["360","","","001","1","360-University of Washington",null,null,"001-1 General Fund-State",0.34,0.34,0.34,0.34,0.34,0.34,0.34,0.34,0.34,0.34,null,null,null,null,null,null,null,null,null,null,null,null,null,null,null,null,{"$f":"VLOOKUP(A232&D232&\"-\"&E232,ActiveFunds!$AH$4:$AI$787,2,0)","v":0}]
["360","","","149","6","360-University of Washington",null,null,"149-6 Inst of Hi Ed-Operating Fees Acct-Non-Appropriated",0.66,0.66,0.66,0.66,0.66,0.66,0.66,0.66,0.66,0.66,null,null,null,null,null,null,null,null,null,null,null,null,null,null,null,null,{"$f":"VLOOKUP(A233&D233&\"-\"&E233,ActiveFunds!$AH$4:$AI$787,2,0)","v":0}]
["365","","","001","1","365-Washington State University",null,null,"001-1 General Fund-State",0.5,0.5,0.5,0.5,0.5,0.5,0.5,0.5,0.5,0.5,null,null,null,null,null,null,null,null,null,null,null,null,null,null,null,null,{"$f":"VLOOKUP(A234&D234&\"-\"&E234,ActiveFunds!$AH$4:$AI$787,2,0)","v":0}]
["365","","","149","6","365-Washington State University",null,null,"149-6 Inst of Hi Ed-Operating Fees Acct-Non-Appropriated",0.5,0.5,0.5,0.5,0.5,0.5,0.5,0.5,0.5,0.5,null,null,null,null,null,null,null,null,null,null,null,null,null,null,null,null,{"$f":"VLOOKUP(A235&D235&\"-\"&E235,ActiveFunds!$AH$4:$AI$787,2,0)","v":0}]
["370","","","001","1","370-Eastern Washington University",null,null,"001-1 General Fund-State",0.52,0.52,0.52,0.52,0.52,0.52,0.52,0.52,0.52,0.52,null,null,null,null,null,null,null,null,null,null,null,null,null,null,null,null,{"$f":"VLOOKUP(A236&D236&\"-\"&E236,ActiveFunds!$AH$4:$AI$787,2,0)","v":0}]
["370","","","149","6","370-Eastern Washington University",null,null,"149-6 Inst of Hi Ed-Operating Fees Acct-Non-Appropriated",0.48,0.48,0.48,0.48,0.48,0.48,0.48,0.48,0.48,0.48,null,null,null,null,null,null,null,null,null,null,null,null,null,null,null,null,{"$f":"VLOOKUP(A237&D237&\"-\"&E237,ActiveFunds!$AH$4:$AI$787,2,0)","v":0}]
["375","","","001","1","375-Central Washington University",null,null,"001-1 General Fund-State",0.51,0.51,0.51,0.51,0.51,0.51,0.51,0.51,0.51,0.51,null,null,null,null,null,null,null,null,null,null,null,null,null,null,null,null,{"$f":"VLOOKUP(A238&D238&\"-\"&E238,ActiveFunds!$AH$4:$AI$787,2,0)","v":0}]
["375","","","149","6","375-Central Washington University",null,null,"149-6 Inst of Hi Ed-Operating Fees Acct-Non-Appropriated",0.49,0.49,0.49,0.49,0.49,0.49,0.49,0.49,0.49,0.49,null,null,null,null,null,null,null,null,null,null,null,null,null,null,null,null,{"$f":"VLOOKUP(A239&D239&\"-\"&E239,ActiveFunds!$AH$4:$AI$787,2,0)","v":0}]
["376","","","001","1","376-The Evergreen State College",null,null,"001-1 General Fund-State",0.48,0.48,0.48,0.48,0.48,0.48,0.48,0.48,0.48,0.48,null,null,null,null,null,null,null,null,null,null,null,null,null,null,null,null,{"$f":"VLOOKUP(A240&D240&\"-\"&E240,ActiveFunds!$AH$4:$AI$787,2,0)","v":0}]
["376","","","149","6","376-The Evergreen State College",null,null,"149-6 Inst of Hi Ed-Operating Fees Acct-Non-Appropriated",0.52,0.52,0.52,0.52,0.52,0.52,0.52,0.52,0.52,0.52,null,null,null,null,null,null,null,null,null,null,null,null,null,null,null,null,{"$f":"VLOOKUP(A241&D241&\"-\"&E241,ActiveFunds!$AH$4:$AI$787,2,0)","v":0}]
["380","","","001","1","380-Western Washington University",null,null,"001-1 General Fund-State",0.51,0.51,0.51,0.51,0.51,0.51,0.51,0.51,0.51,0.51,null,null,null,null,null,null,null,null,null,null,null,null,null,null,null,null,{"$f":"VLOOKUP(A242&D242&\"-\"&E242,ActiveFunds!$AH$4:$AI$787,2,0)","v":0}]
["380","","","149","6","380-Western Washington University",null,null,"149-6 Inst of Hi Ed-Operating Fees Acct-Non-Appropriated",0.49,0.49,0.49,0.49,0.49,0.49,0.49,0.49,0.49,0.49,null,null,null,null,null,null,null,null,null,null,null,null,null,null,null,null,{"$f":"VLOOKUP(A243&D243&\"-\"&E243,ActiveFunds!$AH$4:$AI$787,2,0)","v":0}]
[{"$f":"LEFT(F244,3)","v":"387"},{"$f":"IF(G244=\"\",\"\",LEFT(G244,3))","v":""},{"$f":"IF(H244=\"\",\"\",LEFT(H244,4))","v":""},{"$f":"LEFT(I244,3)","v":"001"},{"$f":"MID(I244,5,1)","v":"1"},"387-Washington State Arts Commission",null,null,"001-1 General Fund-State",1,1,1,1,1,1,1,1,1,1,null,null,null,null,null,null,null,null,null,null,null,null,null,null,null,null,{"$f":"VLOOKUP(A244&D244&\"-\"&E244,ActiveFunds!$AH$4:$AI$787,2,0)","v":0}]
["390","","","001","1","390-Washington State Historical Society",null,null,"001-1 General Fund-State",0.96,0.96,0.96,0.96,0.96,0.96,0.96,0.96,0.96,0.96,null,null,null,null,null,null,null,null,null,null,null,null,null,null,null,null,{"$f":"VLOOKUP(A245&D245&\"-\"&E245,ActiveFunds!$AH$4:$AI$787,2,0)","v":0}]
["390","","","184","6","390-Washington State Historical Society",null,null,"184-6 Local Museum Acct-Wa St Hist Soc-Non-Appropriated",0.04,0.04,0.04,0.04,0.04,0.04,0.04,0.04,0.04,0.04,null,null,null,null,null,null,null,null,null,null,null,null,null,null,null,null,{"$f":"VLOOKUP(A246&D246&\"-\"&E246,ActiveFunds!$AH$4:$AI$787,2,0)","v":0}]
["395","","","001","1","395-East Wash State Historical Society",null,null,"001-1 General Fund-State",1,1,1,1,1,1,1,1,1,1,null,null,null,null,null,null,null,null,null,null,null,null,null,null,null,null,{"$f":"VLOOKUP(A247&D247&\"-\"&E247,ActiveFunds!$AH$4:$AI$787,2,0)","v":0}]
["405","B00","","108","1","405-Department of Transportation","B00-Program B - Toll Operations & Maintenance",null,"108-1 Motor Vehicle Account-State",0,0,0,0,0,0,0,0,0,0,null,null,null,null,null,null,null,null,null,null,null,null,null,null,null,null,{"$f":"VLOOKUP(A248&D248&\"-\"&E248,ActiveFunds!$AH$4:$AI$787,2,0)","v":1}]
["405","B00","","09F","1","405-Department of Transportation","B00-Program B - Toll Operations & Maintenance",null,"09F-1 High-Occupancy Toll Lanes Op Acct-State",0,0,0,0,0,0,6.9999999999999999E-4,0,0,0,null,null,null,null,null,null,null,null,null,null,null,null,null,null,null,null,{"$f":"VLOOKUP(A249&D249&\"-\"&E249,ActiveFunds!$AH$4:$AI$787,2,0)","v":1}]
["405","B00","","16J","1","405-Department of Transportation","B00-Program B - Toll Operations & Maintenance",null,"16J-1 SR 520 Corridor Account-State",0,0,0,0,0,0,4.1999999999999997E-3,0,0,0,null,null,null,null,null,null,null,null,null,null,null,null,null,null,null,null,{"$f":"VLOOKUP(A250&D250&\"-\"&E250,ActiveFunds!$AH$4:$AI$787,2,0)","v":1}]
["405","B00","","511","1","405-Department of Transportation","B00-Program B - Toll Operations & Maintenance",null,"511-1 Tacoma Narrows Toll Bridge Account-State",0,0,0,0,0,0,2.5000000000000001E-3,0,0,0,null,null,null,null,null,null,null,null,null,null,null,null,null,null,null,null,{"$f":"VLOOKUP(A251&D251&\"-\"&E251,ActiveFunds!$AH$4:$AI$787,2,0)","v":1}]
["405","B00","","595","1","405-Department of Transportation","B00-Program B - Toll Operations & Maintenance",null,"595-1 I-405 Express Toll Lanes Operations-State",0,0,0,0,0,0,2.3E-3,0,0,0,null,null,null,null,null,null,null,null,null,null,null,null,null,null,null,null,{"$f":"VLOOKUP(A252&D252&\"-\"&E252,ActiveFunds!$AH$4:$AI$787,2,0)","v":1}]
["405","C00","","108","1","405-Department of Transportation","C00-Program C - Information Technology",null,"108-1 Motor Vehicle Account-State",0,0,0,0,0,0,6.9900000000000004E-2,0,0,0,null,null,null,null,null,null,null,null,null,null,null,null,null,null,null,null,{"$f":"VLOOKUP(A253&D253&\"-\"&E253,ActiveFunds!$AH$4:$AI$787,2,0)","v":1}]
["405","C00","","218","1","405-Department of Transportation","C00-Program C - Information Technology",null,"218-1 Multimodal Transportation Account-State",0,0,0,0,0,0,4.5999999999999999E-3,0,0,0,null,null,null,null,null,null,null,null,null,null,null,null,null,null,null,null,{"$f":"VLOOKUP(A254&D254&\"-\"&E254,ActiveFunds!$AH$4:$AI$787,2,0)","v":1}]
["405","D00","","108","1","405-Department of Transportation","D00-Program D - Facilities - Operating",null,"108-1 Motor Vehicle Account-State",0,0,0,0,0,0,1.5800000000000002E-2,0,0,0,null,null,null,null,null,null,null,null,null,null,null,null,null,null,null,null,{"$f":"VLOOKUP(A255&D255&\"-\"&E255,ActiveFunds!$AH$4:$AI$787,2,0)","v":1}]
["405","F00","","039","1","405-Department of Transportation","F00-Program F - Aviation",null,"039-1 Aeronautics Account-State",0,0,0,0,0,0,3.5999999999999999E-3,0,0,0,null,null,null,null,null,null,null,null,null,null,null,null,null,null,null,null,{"$f":"VLOOKUP(A256&D256&\"-\"&E256,ActiveFunds!$AH$4:$AI$787,2,0)","v":1}]
["405","H00","","108","1","405-Department of Transportation","H00-Program H - Program Delivery Management & Support",null,"108-1 Motor Vehicle Account-State",0,0,0,0,0,0,6.4100000000000004E-2,0,0,0,null,null,null,null,null,null,null,null,null,null,null,null,null,null,null,null,{"$f":"VLOOKUP(A257&D257&\"-\"&E257,ActiveFunds!$AH$4:$AI$787,2,0)","v":1}]
["405","M00","","16J","1","405-Department of Transportation","M00-Program M - Highway Maintenance",null,"16J-1 SR 520 Corridor Account-State",0,0,0,0,0,0,8.9999999999999998E-4,0,0,0,null,null,null,null,null,null,null,null,null,null,null,null,null,null,null,null,{"$f":"VLOOKUP(A258&D258&\"-\"&E258,ActiveFunds!$AH$4:$AI$787,2,0)","v":1}]
["405","M00","","511","1","405-Department of Transportation","M00-Program M - Highway Maintenance",null,"511-1 Tacoma Narrows Toll Bridge Account-State",0,0,0,0,0,0,1E-3,0,0,0,null,null,null,null,null,null,null,null,null,null,null,null,null,null,null,null,{"$f":"VLOOKUP(A259&D259&\"-\"&E259,ActiveFunds!$AH$4:$AI$787,2,0)","v":1}]
["405","M00","","108","1","405-Department of Transportation","M00-Program M - Highway Maintenance",null,"108-1 Motor Vehicle Account-State",0,0,0,0,0,0,0.33200000000000002,0,0,0,null,null,null,null,null,null,null,null,null,null,null,null,null,null,null,null,{"$f":"VLOOKUP(A260&D260&\"-\"&E260,ActiveFunds!$AH$4:$AI$787,2,0)","v":1}]
["405","Q00","","108","1","405-Department of Transportation","Q00-Program Q - Traffic Operations",null,"108-1 Motor Vehicle Account-State",0,0,0,0,0,0,5.9900000000000002E-2,0,0,0,null,null,null,null,null,null,null,null,null,null,null,null,null,null,null,null,{"$f":"VLOOKUP(A261&D261&\"-\"&E261,ActiveFunds!$AH$4:$AI$787,2,0)","v":1}]
["405","S00","","108","1","405-Department of Transportation","S00-Program S - Transportation Management - Operating",null,"108-1 Motor Vehicle Account-State",0,0,0,0,0,0,3.5999999999999997E-2,0,0,0,null,null,null,null,null,null,null,null,null,null,null,null,null,null,null,null,{"$f":"VLOOKUP(A262&D262&\"-\"&E262,ActiveFunds!$AH$4:$AI$787,2,0)","v":1}]
["405","S00","","218","1","405-Department of Transportation","S00-Program S - Transportation Management - Operating",null,"218-1 Multimodal Transportation Account-State",0,0,0,0,0,0,1.6999999999999999E-3,0,0,0,null,null,null,null,null,null,null,null,null,null,null,null,null,null,null,null,{"$f":"VLOOKUP(A263&D263&\"-\"&E263,ActiveFunds!$AH$4:$AI$787,2,0)","v":1}]
["405","T00","","108","1","405-Department of Transportation","T00-Program T - Transportation Planning, Data and Research - Op",null,"108-1 Motor Vehicle Account-State",0,0,0,0,0,0,2.1399999999999999E-2,0,0,0,null,null,null,null,null,null,null,null,null,null,null,null,null,null,null,null,{"$f":"VLOOKUP(A264&D264&\"-\"&E264,ActiveFunds!$AH$4:$AI$787,2,0)","v":1}]
["405","T00","","218","1","405-Department of Transportation","T00-Program T - Transportation Planning, Data and Research - Op",null,"218-1 Multimodal Transportation Account-State",0,0,0,0,0,0,1.2999999999999999E-3,0,0,0,null,null,null,null,null,null,null,null,null,null,null,null,null,null,null,null,{"$f":"VLOOKUP(A265&D265&\"-\"&E265,ActiveFunds!$AH$4:$AI$787,2,0)","v":1}]
["405","U00","","108","1","405-Department of Transportation","U00-Program U - Charges from Other Agencies",null,"108-1 Motor Vehicle Account-State",0.8,0.8,0.8,0.8,0.8,0.8,0,0.8,0.8,0.8,null,null,null,null,null,null,null,null,null,null,null,null,null,null,null,null,{"$f":"VLOOKUP(A266&D266&\"-\"&E266,ActiveFunds!$AH$4:$AI$787,2,0)","v":1}]
["405","U00","","218","1","405-Department of Transportation","U00-Program U - Charges from Other Agencies",null,"218-1 Multimodal Transportation Account-State",0.2,0.2,0.2,0.2,0.2,0.2,0,0.2,0.2,0.2,null,null,null,null,null,null,null,null,null,null,null,null,null,null,null,null,{"$f":"VLOOKUP(A267&D267&\"-\"&E267,ActiveFunds!$AH$4:$AI$787,2,0)","v":1}]
["405","V00","","218","1","405-Department of Transportation","V00-Program V - Public Transportation",null,"218-1 Multimodal Transportation Account-State",0,0,0,0,0,0,5.1999999999999998E-3,0,0,0,null,null,null,null,null,null,null,null,null,null,null,null,null,null,null,null,{"$f":"VLOOKUP(A268&D268&\"-\"&E268,ActiveFunds!$AH$4:$AI$787,2,0)","v":1}]
["405","X00","","109","1","405-Department of Transportation","X00-Program X - Washington State Ferries - Operating",null,"109-1 Puget Sound Ferry Operations Acct-State",0,0,0,0,0,0,0.35909999999999997,0,0,0,null,null,null,null,null,null,null,null,null,null,null,null,null,null,null,null,{"$f":"VLOOKUP(A269&D269&\"-\"&E269,ActiveFunds!$AH$4:$AI$787,2,0)","v":1}]
["405","Y00","","218","1","405-Department of Transportation","Y00-Program Y - Rail - Operating",null,"218-1 Multimodal Transportation Account-State",0,0,0,0,0,0,3.3E-3,0,0,0,null,null,null,null,null,null,null,null,null,null,null,null,null,null,null,null,{"$f":"VLOOKUP(A270&D270&\"-\"&E270,ActiveFunds!$AH$4:$AI$787,2,0)","v":1}]
["405","Z00","","108","1","405-Department of Transportation","Z00-Program Z - Local Programs - Operating",null,"108-1 Motor Vehicle Account-State",0,0,0,0,0,0,1.0500000000000001E-2,0,0,0,null,null,null,null,null,null,null,null,null,null,null,null,null,null,null,null,{"$f":"VLOOKUP(A271&D271&\"-\"&E271,ActiveFunds!$AH$4:$AI$787,2,0)","v":1}]
["406","010","","108","1","406-County Road Administration Board","010-Operating",null,"108-1 Motor Vehicle Account-State",1,1,1,1,1,1,1,1,1,1,null,null,null,null,null,null,null,null,null,null,null,null,null,null,null,null,{"$f":"VLOOKUP(A272&D272&\"-\"&E272,ActiveFunds!$AH$4:$AI$787,2,0)","v":1}]
["407","010","","144","1","407-Transportation Improvement Board","010-Operating",null,"144-1 Transportation Improvement Account-State",1,1,1,1,1,1,1,1,1,1,null,null,null,null,null,null,null,null,null,null,null,null,null,null,null,null,{"$f":"VLOOKUP(A273&D273&\"-\"&E273,ActiveFunds!$AH$4:$AI$787,2,0)","v":1}]
["410","","","108","1","410-Transportation Commission",null,null,"108-1 Motor Vehicle Account-State",1,1,1,1,1,1,1,1,1,1,null,null,null,null,null,null,null,null,null,null,null,null,null,null,null,null,{"$f":"VLOOKUP(A274&D274&\"-\"&E274,ActiveFunds!$AH$4:$AI$787,2,0)","v":1}]
["411","010","","108","1","411-Freight Mobility Strategic Invest","010-Operating",null,"108-1 Motor Vehicle Account-State",1,1,1,1,1,1,1,1,1,1,null,null,null,null,null,null,null,null,null,null,null,null,null,null,null,null,{"$f":"VLOOKUP(A275&D275&\"-\"&E275,ActiveFunds!$AH$4:$AI$787,2,0)","v":1}]
[{"$f":"LEFT(F276,3)","v":"460"},{"$f":"IF(G276=\"\",\"\",LEFT(G276,3))","v":""},{"$f":"IF(H276=\"\",\"\",LEFT(H276,4))","v":""},{"$f":"LEFT(I276,3)","v":"001"},{"$f":"MID(I276,5,1)","v":"1"},"460-Columbia River Gorge Commission",null,null,"001-1 General Fund-State",0.5,0.5,0.5,0.5,0.5,0.5,0.5,0.5,0.5,0.5,null,null,null,null,null,null,null,null,null,null,null,null,null,null,null,null,{"$f":"VLOOKUP(A276&D276&\"-\"&E276,ActiveFunds!$AH$4:$AI$787,2,0)","v":0}]
["460","","","001","7","460-Columbia River Gorge Commission",null,null,"001-7 General Fund-Private/Local",0.5,0.5,0.5,0.5,0.5,0.5,0.5,0.5,0.5,0.5,null,null,null,null,null,null,null,null,null,null,null,null,null,null,null,null,{"$f":"VLOOKUP(A277&D277&\"-\"&E277,ActiveFunds!$AH$4:$AI$787,2,0)","v":0}]
["461","","","001","1","461-Department of Ecology",null,null,"001-1 General Fund-State",0.18099999999999999,0.18099999999999999,0.18099999999999999,0.18099999999999999,0.18099999999999999,0.18099999999999999,0.18099999999999999,0.18099999999999999,0.18099999999999999,0.18099999999999999,null,null,null,null,null,null,null,null,null,null,null,null,null,null,null,null,{"$f":"VLOOKUP(A278&D278&\"-\"&E278,ActiveFunds!$AH$4:$AI$787,2,0)","v":0}]
["461","","","044","1","461-Department of Ecology",null,null,"044-1 Waste Reduct/Recycle/Litter Control-State",2.5000000000000001E-2,2.5000000000000001E-2,2.5000000000000001E-2,2.5000000000000001E-2,2.5000000000000001E-2,2.5000000000000001E-2,2.5000000000000001E-2,2.5000000000000001E-2,2.5000000000000001E-2,2.5000000000000001E-2,null,null,null,null,null,null,null,null,null,null,null,null,null,null,null,null,{"$f":"VLOOKUP(A279&D279&\"-\"&E279,ActiveFunds!$AH$4:$AI$787,2,0)","v":0}]
["461","","","173","1","461-Department of Ecology",null,null,"173-1 State Toxics Control Account-State",0.38300000000000001,0.38300000000000001,0.38300000000000001,0.38300000000000001,0.38300000000000001,0.38300000000000001,0.38300000000000001,0.38300000000000001,0.38300000000000001,0.38300000000000001,null,null,null,null,null,null,null,null,null,null,null,null,null,null,null,null,{"$f":"VLOOKUP(A280&D280&\"-\"&E280,ActiveFunds!$AH$4:$AI$787,2,0)","v":0}]
["461","","","174","1","461-Department of Ecology",null,null,"174-1 Local Toxics Control Account-State",1.4999999999999999E-2,1.4999999999999999E-2,1.4999999999999999E-2,1.4999999999999999E-2,1.4999999999999999E-2,1.4999999999999999E-2,1.4999999999999999E-2,1.4999999999999999E-2,1.4999999999999999E-2,1.4999999999999999E-2,null,null,null,null,null,null,null,null,null,null,null,null,null,null,null,null,{"$f":"VLOOKUP(A281&D281&\"-\"&E281,ActiveFunds!$AH$4:$AI$787,2,0)","v":0}]
["461","","","176","1","461-Department of Ecology",null,null,"176-1 Water Quality Permit Account-State",0.151,0.151,0.151,0.151,0.151,0.151,0.151,0.151,0.151,0.151,null,null,null,null,null,null,null,null,null,null,null,null,null,null,null,null,{"$f":"VLOOKUP(A282&D282&\"-\"&E282,ActiveFunds!$AH$4:$AI$787,2,0)","v":0}]
["461","","","182","1","461-Department of Ecology",null,null,"182-1 Underground Storage Tank Account-State",1.2999999999999999E-2,1.2999999999999999E-2,1.2999999999999999E-2,1.2999999999999999E-2,1.2999999999999999E-2,1.2999999999999999E-2,1.2999999999999999E-2,1.2999999999999999E-2,1.2999999999999999E-2,1.2999999999999999E-2,null,null,null,null,null,null,null,null,null,null,null,null,null,null,null,null,{"$f":"VLOOKUP(A283&D283&\"-\"&E283,ActiveFunds!$AH$4:$AI$787,2,0)","v":0}]
["461","","","19G","1","461-Department of Ecology",null,null,"19G-1 Environmental Legacy Stewardship-State",9.6000000000000002E-2,9.6000000000000002E-2,9.6000000000000002E-2,9.6000000000000002E-2,9.6000000000000002E-2,9.6000000000000002E-2,9.6000000000000002E-2,9.6000000000000002E-2,9.6000000000000002E-2,9.6000000000000002E-2,null,null,null,null,null,null,null,null,null,null,null,null,null,null,null,null,{"$f":"VLOOKUP(A284&D284&\"-\"&E284,ActiveFunds!$AH$4:$AI$787,2,0)","v":0}]
["461","","","207","1","461-Department of Ecology",null,null,"207-1 Hazardous Waste Assistance Account-State",2.5999999999999999E-2,2.5999999999999999E-2,2.5999999999999999E-2,2.5999999999999999E-2,2.5999999999999999E-2,2.5999999999999999E-2,2.5999999999999999E-2,2.5999999999999999E-2,2.5999999999999999E-2,2.5999999999999999E-2,null,null,null,null,null,null,null,null,null,null,null,null,null,null,null,null,{"$f":"VLOOKUP(A285&D285&\"-\"&E285,ActiveFunds!$AH$4:$AI$787,2,0)","v":0}]
["461","","","20R","1","461-Department of Ecology",null,null,"20R-1 Radioactive Mixed Waste Account-State",5.6000000000000001E-2,5.6000000000000001E-2,5.6000000000000001E-2,5.6000000000000001E-2,5.6000000000000001E-2,5.6000000000000001E-2,5.6000000000000001E-2,5.6000000000000001E-2,5.6000000000000001E-2,5.6000000000000001E-2,null,null,null,null,null,null,null,null,null,null,null,null,null,null,null,null,{"$f":"VLOOKUP(A286&D286&\"-\"&E286,ActiveFunds!$AH$4:$AI$787,2,0)","v":0}]
["461","","","216","1","461-Department of Ecology",null,null,"216-1 Air Pollution Control Account-State",1.2E-2,1.2E-2,1.2E-2,1.2E-2,1.2E-2,1.2E-2,1.2E-2,1.2E-2,1.2E-2,1.2E-2,null,null,null,null,null,null,null,null,null,null,null,null,null,null,null,null,{"$f":"VLOOKUP(A287&D287&\"-\"&E287,ActiveFunds!$AH$4:$AI$787,2,0)","v":0}]
["461","","","217","1","461-Department of Ecology",null,null,"217-1 Oil Spill Prevention Account-State",0.03,0.03,0.03,0.03,0.03,0.03,0.03,0.03,0.03,0.03,null,null,null,null,null,null,null,null,null,null,null,null,null,null,null,null,{"$f":"VLOOKUP(A288&D288&\"-\"&E288,ActiveFunds!$AH$4:$AI$787,2,0)","v":0}]
["461","","","219","1","461-Department of Ecology",null,null,"219-1 Air Operating Permit Account-State",1.2E-2,1.2E-2,1.2E-2,1.2E-2,1.2E-2,1.2E-2,1.2E-2,1.2E-2,1.2E-2,1.2E-2,null,null,null,null,null,null,null,null,null,null,null,null,null,null,null,null,{"$f":"VLOOKUP(A289&D289&\"-\"&E289,ActiveFunds!$AH$4:$AI$787,2,0)","v":0}]
["462","","","544","1","462-WA Pollution Liab Insurance Program",null,null,"544-1 Pollution Liab Insurance Prog Trust-State",1,1,1,1,1,1,0.72,1,1,1,null,null,null,null,null,null,null,null,null,null,null,null,null,null,null,null,{"$f":"VLOOKUP(A290&D290&\"-\"&E290,ActiveFunds!$AH$4:$AI$787,2,0)","v":0}]
["462","","","545","6","462-WA Pollution Liab Insurance Program",null,null,"545-6 Heating Oil Pollution Liab Trust-Non-Appropriated",0,0,0,0,0,0,0.28000000000000003,0,0,0,null,null,null,null,null,null,null,null,null,null,null,null,null,null,null,null,{"$f":"VLOOKUP(A291&D291&\"-\"&E291,ActiveFunds!$AH$4:$AI$787,2,0)","v":0}]
["465","","","269","1","465-State Parks and Recreation Comm",null,null,"269-1 Parks Renewal & Stewardship Acct-State",1,1,1,1,1,1,1,1,1,1,null,null,null,null,null,null,null,null,null,null,null,null,null,null,null,null,{"$f":"VLOOKUP(A292&D292&\"-\"&E292,ActiveFunds!$AH$4:$AI$787,2,0)","v":0}]
["467","","","001","1","467-Rec and Conservation Funding Board",null,null,"001-1 General Fund-State",0.4,0.4,0.4,0.4,0.4,0.4,0.4,0.4,0.4,0.4,null,null,null,null,null,null,null,null,null,null,null,null,null,null,null,null,{"$f":"VLOOKUP(A293&D293&\"-\"&E293,ActiveFunds!$AH$4:$AI$787,2,0)","v":0}]
["467","","","267","1","467-Rec and Conservation Funding Board",null,null,"267-1 Recreation Resources Account-State",0.6,0.6,0.6,0.6,0.6,0.6,0.6,0.6,0.6,0.6,null,null,null,null,null,null,null,null,null,null,null,null,null,null,null,null,{"$f":"VLOOKUP(A294&D294&\"-\"&E294,ActiveFunds!$AH$4:$AI$787,2,0)","v":0}]
["468","","","001","1","468-Environ & Land Use Hearings Office",null,null,"001-1 General Fund-State",1,1,1,1,1,1,1,1,1,1,null,null,null,null,null,null,null,null,null,null,null,null,null,null,null,null,{"$f":"VLOOKUP(A295&D295&\"-\"&E295,ActiveFunds!$AH$4:$AI$787,2,0)","v":0}]
["471","","","001","1","471-State Conservation Commission",null,null,"001-1 General Fund-State",1,1,1,1,1,1,1,1,1,1,null,null,null,null,null,null,null,null,null,null,null,null,null,null,null,null,{"$f":"VLOOKUP(A296&D296&\"-\"&E296,ActiveFunds!$AH$4:$AI$787,2,0)","v":0}]
["477","","","001","1","477-Dept of Fish and Wildlife",null,null,"001-1 General Fund-State",0.20809595202398801,0.20809595202398801,0.20809595202398801,0.20809595202398801,0.20809595202398801,0.30064512603959737,0.20809595202398801,0.20809595202398801,0.20809595202398801,0.20809595202398801,null,null,null,null,null,null,null,null,null,null,null,null,null,null,null,null,{"$f":"VLOOKUP(A297&D297&\"-\"&E297,ActiveFunds!$AH$4:$AI$787,2,0)","v":0}]
["477","","","001","2","477-Dept of Fish and Wildlife",null,null,"001-2 General Fund-Federal",0.3078352715534125,0.3078352715534125,0.3078352715534125,0.3078352715534125,0.3078352715534125,0,0.3078352715534125,0.3078352715534125,0.3078352715534125,0.3078352715534125,null,null,null,null,null,null,null,null,null,null,null,null,null,null,null,null,{"$f":"VLOOKUP(A298&D298&\"-\"&E298,ActiveFunds!$AH$4:$AI$787,2,0)","v":0}]
["477","","","001","7","477-Dept of Fish and Wildlife",null,null,"001-7 General Fund-Private/Local",0.16677877277577427,0.16677877277577427,0.16677877277577427,0.16677877277577427,0.16677877277577427,0.24095242927225255,0.16677877277577427,0.16677877277577427,0.16677877277577427,0.16677877277577427,null,null,null,null,null,null,null,null,null,null,null,null,null,null,null,null,{"$f":"VLOOKUP(A299&D299&\"-\"&E299,ActiveFunds!$AH$4:$AI$787,2,0)","v":0}]
["477","","","104","1","477-Dept of Fish and Wildlife",null,null,"104-1 State Wildlife Account-State",0.31729000364682525,0.31729000364682525,0.31729000364682525,0.31729000364682525,0.31729000364682525,0.45840244468815006,0.31729000364682525,0.31729000364682525,0.31729000364682525,0.31729000364682525,null,null,null,null,null,null,null,null,null,null,null,null,null,null,null,null,{"$f":"VLOOKUP(A300&D300&\"-\"&E300,ActiveFunds!$AH$4:$AI$787,2,0)","v":0}]
["478","","","001","1","478-Puget Sound Partnership",null,null,"001-1 General Fund-State",0.55000000000000004,0.55000000000000004,0.55000000000000004,0.55000000000000004,0.55000000000000004,0.85,0.55000000000000004,0.55000000000000004,0.55000000000000004,0.55000000000000004,null,null,null,null,null,null,null,null,null,null,null,null,null,null,null,null,{"$f":"VLOOKUP(A301&D301&\"-\"&E301,ActiveFunds!$AH$4:$AI$787,2,0)","v":0}]
["478","","","001","2","478-Puget Sound Partnership",null,null,"001-2 General Fund-Federal",0.3,0.3,0.3,0.3,0.3,0,0.3,0.3,0.3,0.3,null,null,null,null,null,null,null,null,null,null,null,null,null,null,null,null,{"$f":"VLOOKUP(A302&D302&\"-\"&E302,ActiveFunds!$AH$4:$AI$787,2,0)","v":0}]
["478","","","02R","1","478-Puget Sound Partnership",null,null,"02R-1 Aquatic Lands Enhancement Account-State",0.1,0.1,0.1,0.1,0.1,0.1,0.1,0.1,0.1,0.1,null,null,null,null,null,null,null,null,null,null,null,null,null,null,null,null,{"$f":"VLOOKUP(A303&D303&\"-\"&E303,ActiveFunds!$AH$4:$AI$787,2,0)","v":0}]
["478","","","173","1","478-Puget Sound Partnership",null,null,"173-1 State Toxics Control Account-State",0.05,0.05,0.05,0.05,0.05,0.05,0.05,0.05,0.05,0.05,null,null,null,null,null,null,null,null,null,null,null,null,null,null,null,null,{"$f":"VLOOKUP(A304&D304&\"-\"&E304,ActiveFunds!$AH$4:$AI$787,2,0)","v":0}]
["490","","","001","1","490-Department of Natural Resources",null,null,"001-1 General Fund-State",0.18179999999999999,0.221,0.18179999999999999,0.16900000000000001,0.18179999999999999,0.16900000000000001,0.73,0.18179999999999999,0.18179999999999999,0.18179999999999999,null,null,null,null,null,null,null,null,null,null,null,null,null,null,null,null,{"$f":"VLOOKUP(A305&D305&\"-\"&E305,ActiveFunds!$AH$4:$AI$787,2,0)","v":0}]
["490","","","001","2","490-Department of Natural Resources",null,null,"001-2 General Fund-Federal",0,3.0000000000000001E-3,0,4.3999999999999997E-2,0,4.3999999999999997E-2,0,0,0,0,null,null,null,null,null,null,null,null,null,null,null,null,null,null,null,null,{"$f":"VLOOKUP(A306&D306&\"-\"&E306,ActiveFunds!$AH$4:$AI$787,2,0)","v":0}]
["490","","","014","1","490-Department of Natural Resources",null,null,"014-1 Forest Development Account-State",0.16669999999999999,0.105,0.16669999999999999,0.16200000000000001,0.16669999999999999,0.16200000000000001,0.05,0.16669999999999999,0.16669999999999999,0.16669999999999999,null,null,null,null,null,null,null,null,null,null,null,null,null,null,null,null,{"$f":"VLOOKUP(A307&D307&\"-\"&E307,ActiveFunds!$AH$4:$AI$787,2,0)","v":0}]
[{"$f":"LEFT(F308,3)","v":"490"},{"$f":"IF(G308=\"\",\"\",LEFT(G308,3))","v":""},{"$f":"IF(H308=\"\",\"\",LEFT(H308,4))","v":""},{"$f":"LEFT(I308,3)","v":"01B"},{"$f":"MID(I308,5,1)","v":"1"},"490-Department of Natural Resources",null,null,"01B-1 ORV & Non-Highway Vehicle Account-State",1.83E-2,1.2999999999999999E-2,1.83E-2,1.7000000000000001E-2,1.83E-2,1.7000000000000001E-2,0.04,1.83E-2,1.83E-2,1.83E-2,null,null,null,null,null,null,null,null,null,null,null,null,null,null,null,null,{"$f":"VLOOKUP(A308&D308&\"-\"&E308,ActiveFunds!$AH$4:$AI$787,2,0)","v":0}]
["490","","","02A","1","490-Department of Natural Resources",null,null,"02A-1 Surveys and Maps Account-State",5.1000000000000004E-3,1E-3,5.1000000000000004E-3,1.0999999999999999E-2,5.1000000000000004E-3,1.0999999999999999E-2,0,5.1000000000000004E-3,5.1000000000000004E-3,5.1000000000000004E-3]
["490","","","02R","1","490-Department of Natural Resources",null,null,"02R-1 Aquatic Lands Enhancement Account-State",2.5399999999999999E-2,2.9000000000000001E-2,2.5399999999999999E-2,1.2999999999999999E-2,2.5399999999999999E-2,1.2999999999999999E-2,0,2.5399999999999999E-2,2.5399999999999999E-2,2.5399999999999999E-2]
["490","","","041","1","490-Department of Natural Resources",null,null,"041-1 Resources Management Cost Account-State",0.36890000000000001,0.47199999999999998,0.36890000000000001,0.39,0.36890000000000001,0.39,0.08,0.36890000000000001,0.36890000000000001,0.36890000000000001]
["490","","","04H","1","490-Department of Natural Resources",null,null,"04H-1 Surface Mining Reclamation Account-State",1.12E-2,6.0999999999999999E-2,1.12E-2,5.1999999999999998E-2,1.12E-2,5.1999999999999998E-2,0.01,1.12E-2,1.12E-2,1.12E-2]
["490","","","087","6","490-Department of Natural Resources",null,null,"087-6 Park Land Trust Revolving Account-Non-Appropriated",1.2200000000000001E-2,8.0000000000000002E-3,1.2200000000000001E-2,0.01,1.2200000000000001E-2,0.01,0.01,1.2200000000000001E-2,1.2200000000000001E-2,1.2200000000000001E-2]
["490","","","11H","1","490-Department of Natural Resources",null,null,"11H-1 Forest and Fish Support Account-State",3.0000000000000001E-3,0,3.0000000000000001E-3,6.0000000000000001E-3,3.0000000000000001E-3,6.0000000000000001E-3,0,3.0000000000000001E-3,3.0000000000000001E-3,3.0000000000000001E-3]
["490","","","16P","1","490-Department of Natural Resources",null,null,"16P-1 Marine Resources Stewardship Trust-State",1E-3,0,1E-3,2E-3,1E-3,2E-3,0,1E-3,1E-3,1E-3]
["490","","","173","1","490-Department of Natural Resources",null,null,"173-1 State Toxics Control Account-State",1.83E-2,3.5999999999999997E-2,1.83E-2,4.2999999999999997E-2,1.83E-2,4.2999999999999997E-2,0,1.83E-2,1.83E-2,1.83E-2]
["490","","","190","6","490-Department of Natural Resources",null,null,"190-6 Forest Fire Protection Assessment-Non-Appropriated",6.2E-2,1.9E-2,6.2E-2,3.9E-2,6.2E-2,3.9E-2,0.01,6.2E-2,6.2E-2,6.2E-2]
["490","","","193","6","490-Department of Natural Resources",null,null,"193-6 State Forest Nursery Revolving Acct-Non-Appropriated",2.1430000000000001E-2,3.0000000000000001E-3,2.1430000000000001E-2,0,2.1430000000000001E-2,0,0.05,2.1430000000000001E-2,2.1430000000000001E-2,2.1430000000000001E-2]
["490","","","198","6","490-Department of Natural Resources",null,null,"198-6 Access Road Revolving Account-Non-Appropriated",8.1299999999999997E-2,1.2999999999999999E-2,8.1299999999999997E-2,2.1000000000000001E-2,8.1299999999999997E-2,2.1000000000000001E-2,0.02,8.1299999999999997E-2,8.1299999999999997E-2,8.1299999999999997E-2]
["490","","","19C","1","490-Department of Natural Resources",null,null,"19C-1 Forest Practices Application Acct-State",6.1000000000000004E-3,8.9999999999999993E-3,6.1000000000000004E-3,4.0000000000000001E-3,6.1000000000000004E-3,4.0000000000000001E-3,0,6.1000000000000004E-3,6.1000000000000004E-3,6.1000000000000004E-3]
["490","","","216","1","490-Department of Natural Resources",null,null,"216-1 Air Pollution Control Account-State",4.1000000000000003E-3,1E-3,4.1000000000000003E-3,2E-3,4.1000000000000003E-3,2E-3,0,4.1000000000000003E-3,4.1000000000000003E-3,4.1000000000000003E-3]
["490","","","268","1","490-Department of Natural Resources",null,null,"268-1 NOVA Program Account-State",2E-3,2E-3,2E-3,5.0000000000000001E-3,2E-3,5.0000000000000001E-3,0,2E-3,2E-3,2E-3]
["490","","","513","1","490-Department of Natural Resources",null,null,"513-1 Derelict Vessel Removal Account-State",1E-3,3.0000000000000001E-3,1E-3,2E-3,1E-3,2E-3,0,1E-3,1E-3,1E-3]
["490","","","830","1","490-Department of Natural Resources",null,null,"830-1 Agricultural Coll Trust Mgmt Acct-State",1.0200000000000001E-2,1E-3,1.0200000000000001E-2,8.0000000000000002E-3,1.0200000000000001E-2,8.0000000000000002E-3,0,1.0200000000000001E-2,1.0200000000000001E-2,1.0200000000000001E-2]
["495","","","001","1","495-Department of Agriculture",null,null,"001-1 General Fund-State",0.18,0.18,0.18,0.18,0.18,0.33,0.18,0.18,0.18,0.18]
["495","","","001","2","495-Department of Agriculture",null,null,"001-2 General Fund-Federal",0.15,0.15,0.15,0.15,0.15,0,0.15,0.15,0.15,0.15]
["495","","","02R","1","495-Department of Agriculture",null,null,"02R-1 Aquatic Lands Enhancement Account-State",0.02,0.02,0.02,0.02,0.02,0.02,0.02,0.02,0.02,0.02]
["495","","","108","1","495-Department of Agriculture",null,null,"108-1 Motor Vehicle Account-State",0.01,0.01,0.01,0.01,0.01,0.01,0.01,0.01,0.01,0.01]
["495","","","126","6","495-Department of Agriculture",null,null,"126-6 Agricultural Local Account-Non-Appropriated",0.3,0.3,0.3,0.3,0.3,0.3,0.3,0.3,0.3,0.3]
["495","","","128","6","495-Department of Agriculture",null,null,"128-6 Grain Inspection Revolving Acct-Non-Appropriated",0.12,0.12,0.12,0.12,0.12,0.12,0.12,0.12,0.12,0.12]
["495","","","131","6","495-Department of Agriculture",null,null,"131-6 Fair Account-Non-Appropriated",0,0,0,0,0,0,0,0,0,0]
["495","","","173","1","495-Department of Agriculture",null,null,"173-1 State Toxics Control Account-State",0.03,0.03,0.03,0.03,0.03,0.03,0.03,0.03,0.03,0.03]
["495","","","176","1","495-Department of Agriculture",null,null,"176-1 Water Quality Permit Account-State",0,0,0,0,0,0,0,0,0,0]
["495","","","516","6","495-Department of Agriculture",null,null,"516-6 Fruit and Vegetable Inspection Acct-Non-Appropriated",0.19,0.19,0.19,0.19,0.19,0.19,0.19,0.19,0.19,0.19]
["540","","","001","2","540-Employment Security Department",null,null,"001-2 General Fund-Federal",5.9799999999999999E-2,5.9799999999999999E-2,5.9799999999999999E-2,5.9799999999999999E-2,5.9799999999999999E-2,0,0.04,5.9799999999999999E-2,5.9799999999999999E-2,5.9799999999999999E-2]
["540","","","001","7","540-Employment Security Department",null,null,"001-7 General Fund-Private/Local",1.2500000000000001E-2,1.2500000000000001E-2,1.2500000000000001E-2,1.2500000000000001E-2,1.2500000000000001E-2,1.2500000000000001E-2,0.12,1.2500000000000001E-2,1.2500000000000001E-2,1.2500000000000001E-2]
["540","","","119","2","540-Employment Security Department",null,null,"119-2 Unemployment Compensation Admin-Federal",0.69469999999999998,0.69469999999999998,0.69469999999999998,0.69469999999999998,0.69469999999999998,0,0.79,0.69469999999999998,0.69469999999999998,0.69469999999999998]
["540","","","120","1","540-Employment Security Department",null,null,"120-1 Administrative Contingency Account-State",0.1118,0.1118,0.1118,0.1118,0.1118,0.48904999999999998,0.02,0.1118,0.1118,0.1118]
["540","","","134","1","540-Employment Security Department",null,null,"134-1 Employment Services Administrative-State",0.1212,0.1212,0.1212,0.1212,0.1212,0.49845,0.03,0.1212,0.1212,0.1212,null,null,null,null,null,null,null,null,null,null,null,null,{"$f":"VLOOKUP(#REF!&#REF!&\"-\"&A339,ActiveFunds!$AH$4:$AI$787,2,0)","v":{"$error":"#REF!"}}]
["699","","","001","1","699-Community/Technical College System",null,null,"001-1 General Fund-State",0.67,0.67,0.67,0.67,0.67,0.67,0.67,0.67,0.67,0.67]
["699","","","149","6","699-Community/Technical College System",null,null,"149-6 Inst of Hi Ed-Operating Fees Acct-Non-Appropriated",0.33,0.33,0.33,0.33,0.33,0.33,0.33,0.33,0.33,0.33]

{"sheet":"ActiveFunds","index":3,"n_rows":893,"n_cols":43,"rows_kept":893,"cut":false,"hidden":true,"merged":[]}
[null,null,null,"001-1",null,null,null,"001-2 General Fund-Federal",null,{"$f":"COUNTIF(AgencyFund,Agency)","v":2},null,null,"",{"$f":"IF(pgmcheck=1,OFFSET(AgencyProgram,MATCH((AgyCode),AgencyProgram,0)-1,4,COUNTIF(AgencyProgram,AgyCode)),PgmList)","v":{"$error":"#VALUE!"}},null,null,null,"IF(AgyChoice=1,FundList,OFFSET(AgencyFund,MATCH((Agency),AgencyFund,0)-1,1,COUNTIF(AgencyFund,Agency)))"]
[null,"AgencyFund Table",null,null,null,null,null,null,null,null,"Distinct Fund List",null,null,"Programcheck",null,{"$f":"IFERROR(INDEX($M$4:$M$67,MATCH(AgyCode,ActiveFunds!$N$4:$N$72,0)),0)","v":0},null,{"$f":"IF(pgmcheck=1,OFFSET(AgencyProgram,MATCH((AgyCode),AgencyProgram,0)-1,4,COUNTIF(AgencyProgram,AgyCode)),OFFSET(pgmcheck,0,1))","v":0},{"$f":"IF(pgmcheck=1,OFFSET(AgencyProgram,MATCH((AgyCode),AgencyProgram,0)-1,4,COUNTIF(AgencyProgram,AgyCode)),PgmList)","v":{"$error":"#VALUE!"}},null,null,null,null,"IF(pgmcheck=1,OFFSET(AgencyProgram,MATCH((AgyCode),AgencyProgram,0)-1,4,COUNTIF(AgencyProgram,AgyCode)),$A$2)"]
[null,"Agency","Fund","Column1",null,null,null,"Agency",null,null,"Fund",null,null,"Agency","ProgramCode","BudgetType","SummFlag","ProgramTitle60","Program2",null,null,null,null,null,null,null,null,null,null,null,null,null,null,null,null,null,null,"NGFS & Totals",null,"FY's & Biennial Totals",null,null,"M"]
[null,"011-House of Representatives","001-1 General Fund-State",{"$f":"LEFT(ActiveFunds!$C4,5)","v":"001-1"},{"$f":"IFERROR(IF(VLOOKUP(D4,$AH$5:$AI$786,2,0)=\"O\",0,IF(VLOOKUP(D4,#REF!,2,0)=\"T\",1,0)),\"ERROR\")","v":"ERROR"},"All",1,"All Agencies",{"$f":"LEFT(H4,3)","v":"All"},{"$f":"MID(K4,1,5)","v":"001-1"},"001-1 General Fund-State",null,1,"107","HBE","O",false,"Health Care Auth-Health Benefit Exchange",{"$f":"ActiveFunds!$O4&\"-\"&ActiveFunds!$R4","v":"HBE-Health Care Auth-Health Benefit Exchange"},null,{"$f":"N4&O4","v":"107HBE"},{"$f":"O4&\"-\"&R4","v":"HBE-Health Care Auth-Health Benefit Exchange"},null,"Agency","Program","Subprogram","AgencyProgram",null,null,null,null,"Agy","Fund","AgyFund","Flag",null,null,"Totals Only",null,"Biennial Totals Only",null,null,"P"]
[null,"011-House of Representatives","108-1 Motor Vehicle Account-State",{"$f":"LEFT(ActiveFunds!$C5,5)","v":"108-1"},{"$f":"IFERROR(IF(VLOOKUP(D5,#REF!,2,0)=\"O\",0,IF(VLOOKUP(D5,#REF!,2,0)=\"T\",1,0)),\"ERROR\")","v":"ERROR"},"011",2,"011-House of Representatives","011",{"$f":"MID(K5,1,5)","v":"001-2"},"001-2 General Fund-Federal",null,1,"107","OTH","O",false,"Health Care Auth-Other",{"$f":"ActiveFunds!$O5&\"-\"&ActiveFunds!$R5","v":"OTH-Health Care Auth-Other"},null,{"$f":"N5&O5","v":"107OTH"},{"$f":"O5&\"-\"&R5","v":"OTH-Health Care Auth-Other"},null,"300","030","1000-Community Services/RSN             ","300030",null,null,null,null,"010","001-1",{"$f":"AF5&AG5","v":"010001-1"},0,null,null,"NGFS Only",null,"FY's Only",null,null,"C"]
[null,"011-House of Representatives","442-6 Legislative Gift Center Account-Non-Appropriated",{"$f":"LEFT(ActiveFunds!$C6,5)","v":"442-6"},{"$f":"IFERROR(IF(VLOOKUP(D6,#REF!,2,0)=\"O\",0,IF(VLOOKUP(D6,#REF!,2,0)=\"T\",1,0)),\"ERROR\")","v":"ERROR"},"012",3,"012-Senate","012","001-3","001-3 General Fund-Federal Unanticipated",null,1,"107","PEB","O",false,"Health Care Auth-Employee Benefits",{"$f":"ActiveFunds!$O6&\"-\"&ActiveFunds!$R6","v":"PEB-Health Care Auth-Employee Benefits"},null,"107PEB","PEB-Health Care Auth-Employee Benefits",null,"300","030","2000-State Facility Services            ","300030",null,null,null,null,"010","057-1",{"$f":"AF6&AG6","v":"010057-1"},0]
[null,"012-Senate","001-1 General Fund-State",{"$f":"LEFT(ActiveFunds!$C7,5)","v":"001-1"},{"$f":"IFERROR(IF(VLOOKUP(D7,#REF!,2,0)=\"O\",0,IF(VLOOKUP(D7,#REF!,2,0)=\"T\",1,0)),\"ERROR\")","v":"ERROR"},"013",4,"013-Joint Transportation Committee","013","001-7","001-7 General Fund-Private/Local",null,1,"107","SEB","O",false,"School Employee Benefits Board",{"$f":"ActiveFunds!$O7&\"-\"&ActiveFunds!$R7","v":"SEB-School Employee Benefits Board"},null,"107SEB","SEB-School Employee Benefits Board",null,"300","030","8000-Special Projects                   ","300030",null,null,null,null,"010","10P-1","01010P-1",0]
[null,"012-Senate","108-1 Motor Vehicle Account-State",{"$f":"LEFT(ActiveFunds!$C8,5)","v":"108-1"},{"$f":"IFERROR(IF(VLOOKUP(D8,#REF!,2,0)=\"O\",0,IF(VLOOKUP(D8,#REF!,2,0)=\"T\",1,0)),\"ERROR\")","v":"ERROR"},"014",5,"014-Jt Leg Audit & Review Committee","014","001-8","001-8 General Fund-Federal ARRA",null,1,"300","010","O",false,"Children & Family Services",{"$f":"ActiveFunds!$O8&\"-\"&ActiveFunds!$R8","v":"010-Children & Family Services"},null,"300010","010-Children & Family Services",null,"300","030","9000-Program Support                    ","300030",null,null,null,null,"010","10T-1","01010T-1",0]
[null,"013-Joint Transportation Committee","108-1 Motor Vehicle Account-State",{"$f":"LEFT(ActiveFunds!$C9,5)","v":"108-1"},{"$f":"IFERROR(IF(VLOOKUP(D9,#REF!,2,0)=\"O\",0,IF(VLOOKUP(D9,#REF!,2,0)=\"T\",1,0)),\"ERROR\")","v":"ERROR"},"020",6,"020-LEAP Committee","020","001-9","001-9 General Fund-Private/Local Unanticipated",null,1,"300","020","O",false,"Juvenile Rehabilitation",{"$f":"ActiveFunds!$O9&\"-\"&ActiveFunds!$R9","v":"020-Juvenile Rehabilitation"},null,"300020","020-Juvenile Rehabilitation",null,"300","040","1000-Community Services                 ","300040",null,null,null,null,"010","18B-1","01018B-1",0]
[null,"014-Jt Leg Audit & Review Committee","001-1 General Fund-State",{"$f":"LEFT(ActiveFunds!$C10,5)","v":"001-1"},{"$f":"IFERROR(IF(VLOOKUP(D10,#REF!,2,0)=\"O\",0,IF(VLOOKUP(D10,#REF!,2,0)=\"T\",1,0)),\"ERROR\")","v":"ERROR"},"035",7,"035-Office of the State Actuary","035","002-1","002-1 Hospital Data Collection Account-State",null,1,"300","030","O",true,"Mental Health",{"$f":"ActiveFunds!$O10&\"-\"&ActiveFunds!$R10","v":"030-Mental Health"},null,"300030","030-Mental Health",null,"300","040","2000-Residential Habilitation Services  ","300040",null,null,null,null,"010","355-1","010355-1",0]
[null,"014-Jt Leg Audit & Review Committee","553-1 Performance Audits of Govt Acct-State",{"$f":"LEFT(ActiveFunds!$C11,5)","v":"553-1"},{"$f":"IFERROR(IF(VLOOKUP(D11,#REF!,2,0)=\"O\",0,IF(VLOOKUP(D11,#REF!,2,0)=\"T\",1,0)),\"ERROR\")","v":"ERROR"},"037",8,"037-Office of Legislative Support Svcs","037","003-1","003-1 Architects' License Account-State",null,1,"300","040","O",true,"Developmental Disabilities",{"$f":"ActiveFunds!$O11&\"-\"&ActiveFunds!$R11","v":"040-Developmental Disabilities"},null,"300040","040-Developmental Disabilities",null,"300","040","8000-Special Projects                   ","300040",null,null,null,null,"010","357-1","010357-1",0]
[null,"020-LEAP Committee","108-1 Motor Vehicle Account-State",{"$f":"LEFT(ActiveFunds!$C12,5)","v":"108-1"},{"$f":"IFERROR(IF(VLOOKUP(D12,#REF!,2,0)=\"O\",0,IF(VLOOKUP(D12,#REF!,2,0)=\"T\",1,0)),\"ERROR\")","v":"ERROR"},"038",9,"038-Joint Legislative Systems Comm","038","006-1","006-1 Public Records Effic/Presrv/Access-State",null,1,"300","050","O",false,"Long-Term Care Services",{"$f":"ActiveFunds!$O12&\"-\"&ActiveFunds!$R12","v":"050-Long-Term Care Services"},null,"300050","050-Long-Term Care Services",null,"300","040","9000-Program Support                    ","300040",null,null,null,null,"010","381-1","010381-1",0]
[null,"020-LEAP Committee","553-1 Performance Audits of Govt Acct-State",{"$f":"LEFT(ActiveFunds!$C13,5)","v":"553-1"},{"$f":"IFERROR(IF(VLOOKUP(D13,#REF!,2,0)=\"O\",0,IF(VLOOKUP(D13,#REF!,2,0)=\"T\",1,0)),\"ERROR\")","v":"ERROR"},"040",10,"040-Statute Law Committee","040","007-1","007-1 Winter Recreation Program Account-State",null,1,"300","060","O",false,"Economic Services Administration",{"$f":"ActiveFunds!$O13&\"-\"&ActiveFunds!$R13","v":"060-Economic Services Administration"},null,"300060","060-Economic Services Administration",null,null,null,null,null,null,null,null,null,"010","383-1","010383-1",0]
[null,"035-Office of the State Actuary","001-1 General Fund-State",{"$f":"LEFT(ActiveFunds!$C14,5)","v":"001-1"},{"$f":"IFERROR(IF(VLOOKUP(D14,#REF!,2,0)=\"O\",0,IF(VLOOKUP(D14,#REF!,2,0)=\"T\",1,0)),\"ERROR\")","v":"ERROR"},"045",11,"045-Supreme Court","045","014-1","014-1 Forest Development Account-State",null,1,"300","070","O",false,"Alcohol & Substance Abuse",{"$f":"ActiveFunds!$O14&\"-\"&ActiveFunds!$R14","v":"070-Alcohol & Substance Abuse"},null,"300070","070-Alcohol & Substance Abuse",null,null,null,null,null,null,null,null,null,"010","608-1","010608-1",0]
[null,"035-Office of the State Actuary","418-1 St Health Care Authority Admin Acct-State",{"$f":"LEFT(ActiveFunds!$C15,5)","v":"418-1"},{"$f":"IFERROR(IF(VLOOKUP(D15,#REF!,2,0)=\"O\",0,IF(VLOOKUP(D15,#REF!,2,0)=\"T\",1,0)),\"ERROR\")","v":"ERROR"},"046",12,"046-State Law Library","046","01B-1","01B-1 ORV & Non-Highway Vehicle Account-State",null,1,"300","100","O",false,"Vocational Rehabilitation",{"$f":"ActiveFunds!$O15&\"-\"&ActiveFunds!$R15","v":"100-Vocational Rehabilitation"},null,"300100","100-Vocational Rehabilitation",null,"9000-Program Support                    ",null,null,null,null,null,null,null,"010","609-1","010609-1",0]
[null,"035-Office of the State Actuary","600-1 Dept of Retirement Systems Expense-State",{"$f":"LEFT(ActiveFunds!$C16,5)","v":"600-1"},{"$f":"IFERROR(IF(VLOOKUP(D16,#REF!,2,0)=\"O\",0,IF(VLOOKUP(D16,#REF!,2,0)=\"T\",1,0)),\"ERROR\")","v":"ERROR"},"048",13,"048-Court of Appeals","048","01F-6","01F-6 Crime Victims Compensation Account-Non-Appropriated",null,1,"300","110","O",false,"Administration & Supporting Services",{"$f":"ActiveFunds!$O16&\"-\"&ActiveFunds!$R16","v":"110-Administration & Supporting Services"},null,"300110","110-Administration & Supporting Services",null,"2000-State Facility Services            ",null,null,null,null,null,null,null,"011","001-1","011001-1",0]
[null,"037-Office of Legislative Support Svcs","001-1 General Fund-State",{"$f":"LEFT(ActiveFunds!$C17,5)","v":"001-1"},{"$f":"IFERROR(IF(VLOOKUP(D17,#REF!,2,0)=\"O\",0,IF(VLOOKUP(D17,#REF!,2,0)=\"T\",1,0)),\"ERROR\")","v":"ERROR"},"050",14,"050-Commission on Judicial Conduct","050","01M-1","01M-1 Snowmobile Account-State",null,1,"300","135","O",false,"Special Commitment Center",{"$f":"ActiveFunds!$O17&\"-\"&ActiveFunds!$R17","v":"135-Special Commitment Center"},null,"300135","135-Special Commitment Center",null,"1000-Community Services/RSN             ",null,null,null,null,null,null,null,"011","108-1","011108-1",0]
[null,"037-Office of Legislative Support Svcs","14N-6 Legislative Oral History Account-Non-Appropriated",{"$f":"LEFT(ActiveFunds!$C18,5)","v":"14N-6"},{"$f":"IFERROR(IF(VLOOKUP(D18,#REF!,2,0)=\"O\",0,IF(VLOOKUP(D18,#REF!,2,0)=\"T\",1,0)),\"ERROR\")","v":"ERROR"},"055",15,"055-Administrative Office of the Courts","055","024-1","024-1 Professional Engineers' Account-State",null,1,"300","145","O",false,"Payments to Other Agencies",{"$f":"ActiveFunds!$O18&\"-\"&ActiveFunds!$R18","v":"145-Payments to Other Agencies"},null,"300145","145-Payments to Other Agencies",null,"2000-State Facility Services            ",null,null,null,null,null,null,null,"012","001-1","012001-1",0]
[null,"037-Office of Legislative Support Svcs","442-6 Legislative Gift Center Account-Non-Appropriated",{"$f":"LEFT(ActiveFunds!$C19,5)","v":"442-6"},{"$f":"IFERROR(IF(VLOOKUP(D19,#REF!,2,0)=\"O\",0,IF(VLOOKUP(D19,#REF!,2,0)=\"T\",1,0)),\"ERROR\")","v":"ERROR"},"056",16,"056-Office of Public Defense","056","025-6","025-6 Pilotage Account-Non-Appropriated",null,1,"300","150","O",false,"Information System Services",{"$f":"ActiveFunds!$O19&\"-\"&ActiveFunds!$R19","v":"150-Information System Services"},null,"300150","150-Information System Services",null,"9000-Program Support                    ",null,null,null,null,null,null,null,"012","108-1","012108-1",0]
[null,"038-Joint Legislative Systems Comm","001-1 General Fund-State",{"$f":"LEFT(ActiveFunds!$C20,5)","v":"001-1"},{"$f":"IFERROR(IF(VLOOKUP(D20,#REF!,2,0)=\"O\",0,IF(VLOOKUP(D20,#REF!,2,0)=\"T\",1,0)),\"ERROR\")","v":"ERROR"},"057",17,"057-Office of Civil Legal Aid","057","026-1","026-1 Real Estate Commission Account-State",null,1,"300","160","O",false,"Consolidated Field Services",{"$f":"ActiveFunds!$O20&\"-\"&ActiveFunds!$R20","v":"160-Consolidated Field Services"},null,"300160","160-Consolidated Field Services",null,null,null,null,null,null,null,null,null,"014","001-1","014001-1",0]
[null,"040-Statute Law Committee","001-1 General Fund-State",{"$f":"LEFT(ActiveFunds!$C21,5)","v":"001-1"},{"$f":"IFERROR(IF(VLOOKUP(D21,#REF!,2,0)=\"O\",0,IF(VLOOKUP(D21,#REF!,2,0)=\"T\",1,0)),\"ERROR\")","v":"ERROR"},"075",18,"075-Office of the Governor","075","027-1","027-1 Reclamation Account-State",null,1,"305","010","O",false,"Headquarters",{"$f":"ActiveFunds!$O21&\"-\"&ActiveFunds!$R21","v":"010-Headquarters"},null,"305010","010-Headquarters",null,null,null,{"$f":"IF(AND(LEFT(X5,3)=\"300\",LEFT(Y5,3)=\"030\"),$Z$5:$Z$8,IF(AND(LEFT(X5,3)=\"300\",LEFT(Y5,3)=\"040\"),$Z$9:$Z$12,\"\"))","v":{"$error":"#VALUE!"}},null,null,null,null,null,"014","553-1","014553-1",0]
[null,"040-Statute Law Committee","03K-6 Industrial Insurance Premium Refund-Non-Appropriated",{"$f":"LEFT(ActiveFunds!$C22,5)","v":"03K-6"},{"$f":"IFERROR(IF(VLOOKUP(D22,#REF!,2,0)=\"O\",0,IF(VLOOKUP(D22,#REF!,2,0)=\"T\",1,0)),\"ERROR\")","v":"ERROR"},"080",19,"080-Office of the Lieutenant Governor","080","02A-1","02A-1 Surveys and Maps Account-State",null,1,"305","020","O",false,"Field Services",{"$f":"ActiveFunds!$O22&\"-\"&ActiveFunds!$R22","v":"020-Field Services"},null,"305020","020-Field Services",null,null,null,{"$f":"IF(AND(LEFT(X6,3)=\"300\",LEFT(Y6,3)=\"030\"),$Z$5:$Z$8,IF(AND(LEFT(X6,3)=\"300\",LEFT(Y6,3)=\"040\"),$Z$9:$Z$12,\"\"))","v":{"$error":"#VALUE!"}},null,null,null,null,null,"020","553-1","020553-1",0]
[null,"040-Statute Law Committee","197-6 Statute Law Committee Publications-Non-Appropriated",{"$f":"LEFT(ActiveFunds!$C23,5)","v":"197-6"},{"$f":"IFERROR(IF(VLOOKUP(D23,#REF!,2,0)=\"O\",0,IF(VLOOKUP(D23,#REF!,2,0)=\"T\",1,0)),\"ERROR\")","v":"ERROR"},"082",20,"082-Public Disclosure Commission","082","02G-1","02G-1 Health Professions Account-State",null,1,"305","035","O",false,"Institutional Services",{"$f":"ActiveFunds!$O23&\"-\"&ActiveFunds!$R23","v":"035-Institutional Services"},null,"305035","035-Institutional Services",null,null,null,{"$error":"#VALUE!"},null,null,null,null,null,"035","001-1","035001-1",0]
[null,"045-Supreme Court","001-1 General Fund-State",{"$f":"LEFT(ActiveFunds!$C24,5)","v":"001-1"},{"$f":"IFERROR(IF(VLOOKUP(D24,#REF!,2,0)=\"O\",0,IF(VLOOKUP(D24,#REF!,2,0)=\"T\",1,0)),\"ERROR\")","v":"ERROR"},"085",21,"085-Office of the Secretary of State","085","02H-6","02H-6 Business Enterprises Revolving Acct-Non-Appropriated",null,1,"307","010","O",false,"Children and Family",{"$f":"ActiveFunds!$O24&\"-\"&ActiveFunds!$R24","v":"010-Children and Family"},null,{"$f":"N28&O28","v":"310100"},{"$f":"O28&\"-\"&R28","v":"100-Administration & Support Services"},null,null,null,{"$error":"#VALUE!"},null,null,null,null,null,"035","418-1","035418-1",0]
[null,"046-State Law Library","001-1 General Fund-State",{"$f":"LEFT(ActiveFunds!$C25,5)","v":"001-1"},{"$f":"IFERROR(IF(VLOOKUP(D25,#REF!,2,0)=\"O\",0,IF(VLOOKUP(D25,#REF!,2,0)=\"T\",1,0)),\"ERROR\")","v":"ERROR"},"086",22,"086-Governor's Office of Indian Affairs","086","02J-1","02J-1 Certified Public Accountants' Acct-State",null,1,"307","020","O",false,"Juvenile Rehabilitation",{"$f":"ActiveFunds!$O25&\"-\"&ActiveFunds!$R25","v":"020-Juvenile Rehabilitation"},null,"310200","200-Correctional Operations",null,null,null,{"$error":"#VALUE!"},null,null,null,null,null,"035","600-1","035600-1",0]
[null,"048-Court of Appeals","001-1 General Fund-State",{"$f":"LEFT(ActiveFunds!$C26,5)","v":"001-1"},{"$f":"IFERROR(IF(VLOOKUP(D26,#REF!,2,0)=\"O\",0,IF(VLOOKUP(D26,#REF!,2,0)=\"T\",1,0)),\"ERROR\")","v":"ERROR"},"087",23,"087-Asian-Pacific-American Affrs","087","02K-1","02K-1 Death Investigations Account-State",null,1,"307","030","O",false,"Early Learning",{"$f":"ActiveFunds!$O26&\"-\"&ActiveFunds!$R26","v":"030-Early Learning"},null,"310300","300-Community Supervision",null,null,null,{"$error":"#VALUE!"},null,null,null,null,null,"037","001-1","037001-1",0]
[null,"050-Commission on Judicial Conduct","001-1 General Fund-State",{"$f":"LEFT(ActiveFunds!$C27,5)","v":"001-1"},{"$f":"IFERROR(IF(VLOOKUP(D27,#REF!,2,0)=\"O\",0,IF(VLOOKUP(D27,#REF!,2,0)=\"T\",1,0)),\"ERROR\")","v":"ERROR"},"090",24,"090-Office of the State Treasurer","090","02P-1","02P-1 Flood Control Assistance Account-State",null,1,"307","090","O",false,"Program Support",{"$f":"ActiveFunds!$O27&\"-\"&ActiveFunds!$R27","v":"090-Program Support"},null,"310400","400-Correctional Industries",null,null,null,{"$error":"#VALUE!"},null,null,null,null,null,"037","14N-6","03714N-6",0]
[null,"055-Administrative Office of the Courts","001-1 General Fund-State",{"$f":"LEFT(ActiveFunds!$C28,5)","v":"001-1"},{"$f":"IFERROR(IF(VLOOKUP(D28,#REF!,2,0)=\"O\",0,IF(VLOOKUP(D28,#REF!,2,0)=\"T\",1,0)),\"ERROR\")","v":"ERROR"},"095",25,"095-Office of the State Auditor","095","02R-1","02R-1 Aquatic Lands Enhancement Account-State",null,1,"310","100","O",false,"Administration & Support Services",{"$f":"ActiveFunds!$O28&\"-\"&ActiveFunds!$R28","v":"100-Administration & Support Services"},null,"310500","500-Health Care Services",null,null,null,{"$error":"#VALUE!"},null,null,null,null,null,"037","442-6","037442-6",0]
[null,"055-Administrative Office of the Courts","001-2 General Fund-Federal",{"$f":"LEFT(ActiveFunds!$C29,5)","v":"001-2"},{"$f":"IFERROR(IF(VLOOKUP(D29,#REF!,2,0)=\"O\",0,IF(VLOOKUP(D29,#REF!,2,0)=\"T\",1,0)),\"ERROR\")","v":"ERROR"},"099",26,"099-Comm Salaries for Elected Officials","099","02W-1","02W-1 Timber Tax Distribution Account-State",null,1,"310","200","O",false,"Correctional Operations",{"$f":"ActiveFunds!$O29&\"-\"&ActiveFunds!$R29","v":"200-Correctional Operations"},null,"310600","600-Interagency Payments",null,null,null,"",null,null,null,null,null,"038","001-1","038001-1",0]
[null,"055-Administrative Office of the Courts","001-7 General Fund-Private/Local",{"$f":"LEFT(ActiveFunds!$C30,5)","v":"001-7"},{"$f":"IFERROR(IF(VLOOKUP(D30,#REF!,2,0)=\"O\",0,IF(VLOOKUP(D30,#REF!,2,0)=\"T\",1,0)),\"ERROR\")","v":"ERROR"},"100",27,"100-Office of the Attorney General","100","030-6","030-6 Landowner Contng Forest Fire Supp-Non-Appropriated",null,1,"310","300","O",false,"Community Supervision",{"$f":"ActiveFunds!$O30&\"-\"&ActiveFunds!$R30","v":"300-Community Supervision"},null,"310700","700-Offender Change",null,null,null,"",null,null,null,null,null,"040","001-1","040001-1",0]
[null,"055-Administrative Office of the Courts","16A-1 Judicial Stabilization Trust Accoun-State",{"$f":"LEFT(ActiveFunds!$C31,5)","v":"16A-1"},{"$f":"IFERROR(IF(VLOOKUP(D31,#REF!,2,0)=\"O\",0,IF(VLOOKUP(D31,#REF!,2,0)=\"T\",1,0)),\"ERROR\")","v":"ERROR"},"101",28,"101-Caseload Forecast Council","101","031-1","031-1 State Investment Board Expense Acct-State",null,1,"310","400","O",false,"Correctional Industries",{"$f":"ActiveFunds!$O31&\"-\"&ActiveFunds!$R31","v":"400-Correctional Industries"},null,"340PCA","PCA-Policy Coordination & Administration",null,null,null,null,null,null,null,null,null,"040","197-6","040197-6",0]
[null,"055-Administrative Office of the Courts","277-6 State Agency Parking Account-Non-Appropriated",{"$f":"LEFT(ActiveFunds!$C32,5)","v":"277-6"},{"$f":"IFERROR(IF(VLOOKUP(D32,#REF!,2,0)=\"O\",0,IF(VLOOKUP(D32,#REF!,2,0)=\"T\",1,0)),\"ERROR\")","v":"ERROR"},"102",29,"102-Dept of Financial Institutions","102","039-1","039-1 Aeronautics Account-State",null,1,"310","500","O",false,"Health Care Services",{"$f":"ActiveFunds!$O32&\"-\"&ActiveFunds!$R32","v":"500-Health Care Services"},null,"340SFA","SFA-Student Financial Services",null,null,null,null,null,null,null,null,null,"045","001-1","045001-1",0]
[null,"055-Administrative Office of the Courts","543-1 Judicial Information Systems Acct-State",{"$f":"LEFT(ActiveFunds!$C33,5)","v":"543-1"},{"$f":"IFERROR(IF(VLOOKUP(D33,#REF!,2,0)=\"O\",0,IF(VLOOKUP(D33,#REF!,2,0)=\"T\",1,0)),\"ERROR\")","v":"ERROR"},"103",30,"103-Department of Commerce","103","039-2","039-2 Aeronautics Account-Federal",null,1,"310","600","O",false,"Interagency Payments",{"$f":"ActiveFunds!$O33&\"-\"&ActiveFunds!$R33","v":"600-Interagency Payments"},null,"350010","010-OSPI & Statewide Programs",null,null,null,null,null,null,null,null,null,"046","001-1","046001-1",0]
[null,"055-Administrative Office of the Courts","759-6 Miscellaneous Program Account-Non-Appropriated",{"$f":"LEFT(ActiveFunds!$C34,5)","v":"759-6"},{"$f":"IFERROR(IF(VLOOKUP(D34,#REF!,2,0)=\"O\",0,IF(VLOOKUP(D34,#REF!,2,0)=\"T\",1,0)),\"ERROR\")","v":"ERROR"},"104",31,"104-Economic & Revenue Forecast Council","104","039-7","039-7 Aeronautics Account-Private/Local",null,1,"310","700","O",false,"Offender Change",{"$f":"ActiveFunds!$O34&\"-\"&ActiveFunds!$R34","v":"700-Offender Change"},null,"350021","021-General Apportionment",null,null,null,null,null,null,null,null,null,"048","001-1","048001-1",0]
[null,"056-Office of Public Defense","001-1 General Fund-State",{"$f":"LEFT(ActiveFunds!$C35,5)","v":"001-1"},{"$f":"IFERROR(IF(VLOOKUP(D35,#REF!,2,0)=\"O\",0,IF(VLOOKUP(D35,#REF!,2,0)=\"T\",1,0)),\"ERROR\")","v":"ERROR"},"105",32,"105-Office of Financial Management","105","03B-1","03B-1 Asbestos Account-State",null,1,"340","PCA","O",false,"Policy Coordination & Administration",{"$f":"ActiveFunds!$O35&\"-\"&ActiveFunds!$R35","v":"PCA-Policy Coordination & Administration"},null,"350022","022-Pupil Transportation",null,null,null,null,null,null,null,null,null,"050","001-1","050001-1",0]
[null,"056-Office of Public Defense","001-3 General Fund-Federal Unanticipated",{"$f":"LEFT(ActiveFunds!$C36,5)","v":"001-3"},{"$f":"IFERROR(IF(VLOOKUP(D36,#REF!,2,0)=\"O\",0,IF(VLOOKUP(D36,#REF!,2,0)=\"T\",1,0)),\"ERROR\")","v":"ERROR"},"107",33,"107-WA State Health Care Authority","107","03C-1","03C-1 Emer Med Ser/Trauma Care Sys Trust-State",null,1,"340","SFA","O",false,"Student Financial Services",{"$f":"ActiveFunds!$O36&\"-\"&ActiveFunds!$R36","v":"SFA-Student Financial Services"},null,"350025","025-School Food Services",null,null,null,null,null,null,null,null,null,"055","001-1","055001-1",0]
[null,"056-Office of Public Defense","16A-1 Judicial Stabilization Trust Accoun-State",{"$f":"LEFT(ActiveFunds!$C37,5)","v":"16A-1"},{"$f":"IFERROR(IF(VLOOKUP(D37,#REF!,2,0)=\"O\",0,IF(VLOOKUP(D37,#REF!,2,0)=\"T\",1,0)),\"ERROR\")","v":"ERROR"},"110",34,"110-Office of Administrative Hearings","110","03F-1","03F-1 Enhanced 911 Account-State",null,1,"350","010","O",false,"OSPI & Statewide Programs",{"$f":"ActiveFunds!$O37&\"-\"&ActiveFunds!$R37","v":"010-OSPI & Statewide Programs"},null,"350026","026-Special Education",null,null,null,null,null,null,null,null,null,"055","001-2","055001-2",0]
[null,"057-Office of Civil Legal Aid","001-1 General Fund-State",{"$f":"LEFT(ActiveFunds!$C38,5)","v":"001-1"},{"$f":"IFERROR(IF(VLOOKUP(D38,#REF!,2,0)=\"O\",0,IF(VLOOKUP(D38,#REF!,2,0)=\"T\",1,0)),\"ERROR\")","v":"ERROR"},"116",35,"116-State Lottery Commission","116","03K-6","03K-6 Industrial Insurance Premium Refund-Non-Appropriated",null,1,"350","021","O",false,"General Apportionment",{"$f":"ActiveFunds!$O38&\"-\"&ActiveFunds!$R38","v":"021-General Apportionment"},null,"350028","028-Educational Service Districts",null,null,null,null,null,null,null,null,null,"055","001-7","055001-7",0]
[null,"057-Office of Civil Legal Aid","001-7 General Fund-Private/Local",{"$f":"LEFT(ActiveFunds!$C39,5)","v":"001-7"},{"$f":"IFERROR(IF(VLOOKUP(D39,#REF!,2,0)=\"O\",0,IF(VLOOKUP(D39,#REF!,2,0)=\"T\",1,0)),\"ERROR\")","v":"ERROR"},"117",36,"117-Washington State Gambling Comm","117","03L-1","03L-1 County Criminal Justice Assistance-State",null,1,"350","022","O",false,"Pupil Transportation",{"$f":"ActiveFunds!$O39&\"-\"&ActiveFunds!$R39","v":"022-Pupil Transportation"},null,"350029","029-Levy Equalization",null,null,null,null,null,null,null,null,null,"055","16A-1","05516A-1",0]
[null,"057-Office of Civil Legal Aid","16A-1 Judicial Stabilization Trust Accoun-State",{"$f":"LEFT(ActiveFunds!$C40,5)","v":"16A-1"},{"$f":"IFERROR(IF(VLOOKUP(D40,#REF!,2,0)=\"O\",0,IF(VLOOKUP(D40,#REF!,2,0)=\"T\",1,0)),\"ERROR\")","v":"ERROR"},"118",37,"118-WA State Comm on Hispanic Affairs","118","03M-1","03M-1 Municipal Criminal Justice Assist-State",null,1,"350","025","O",false,"School Food Services",{"$f":"ActiveFunds!$O40&\"-\"&ActiveFunds!$R40","v":"025-School Food Services"},null,"350032","032-Elementary & Secondary School Improvement",null,null,null,null,null,null,null,null,null,"055","543-1","055543-1",0]
[null,"057-Office of Civil Legal Aid","17L-6 Foreclosure Fairness Account-Non-Appropriated",{"$f":"LEFT(ActiveFunds!$C41,5)","v":"17L-6"},{"$f":"IFERROR(IF(VLOOKUP(D41,#REF!,2,0)=\"O\",0,IF(VLOOKUP(D41,#REF!,2,0)=\"T\",1,0)),\"ERROR\")","v":"ERROR"},"119",38,"119-African-American Affairs Comm","119","03N-1","03N-1 Business License Account-State",null,1,"350","026","O",false,"Special Education",{"$f":"ActiveFunds!$O41&\"-\"&ActiveFunds!$R41","v":"026-Special Education"},null,"350035","035-Institutional Education",null,null,null,null,null,null,null,null,null,"056","001-1","056001-1",0]
[null,"075-Office of the Governor","001-1 General Fund-State",{"$f":"LEFT(ActiveFunds!$C42,5)","v":"001-1"},{"$f":"IFERROR(IF(VLOOKUP(D42,#REF!,2,0)=\"O\",0,IF(VLOOKUP(D42,#REF!,2,0)=\"T\",1,0)),\"ERROR\")","v":"ERROR"},"120",39,"120-Human Rights Commission","120","03P-1","03P-1 Fire Service Trust Account-State",null,1,"350","028","O",false,"Educational Service Districts",{"$f":"ActiveFunds!$O42&\"-\"&ActiveFunds!$R42","v":"028-Educational Service Districts"},null,"350045","045-Education of Highly Capable Students",null,null,null,null,null,null,null,null,null,"056","16A-1","05616A-1",0]
[null,"075-Office of the Governor","03K-6 Industrial Insurance Premium Refund-Non-Appropriated",{"$f":"LEFT(ActiveFunds!$C43,5)","v":"03K-6"},{"$f":"IFERROR(IF(VLOOKUP(D43,#REF!,2,0)=\"O\",0,IF(VLOOKUP(D43,#REF!,2,0)=\"T\",1,0)),\"ERROR\")","v":"ERROR"},"124",40,"124-Department of Retirement Systems","124","03R-1","03R-1 Safe Drinking Water Account-State",null,1,"350","029","O",false,"Levy Equalization",{"$f":"ActiveFunds!$O43&\"-\"&ActiveFunds!$R43","v":"029-Levy Equalization"},null,"350055","055-Education Reform",null,null,null,null,null,null,null,null,null,"057","001-1","057001-1",0]
[null,"075-Office of the Governor","09R-1 Econ Dev Strategic Reserve Account-State",{"$f":"LEFT(ActiveFunds!$C44,5)","v":"09R-1"},{"$f":"IFERROR(IF(VLOOKUP(D44,#REF!,2,0)=\"O\",0,IF(VLOOKUP(D44,#REF!,2,0)=\"T\",1,0)),\"ERROR\")","v":"ERROR"},"126",41,"126-State Investment Board","126","041-1","041-1 Resources Management Cost Account-State",null,1,"350","032","O",false,"Elementary & Secondary School Improvement",{"$f":"ActiveFunds!$O44&\"-\"&ActiveFunds!$R44","v":"032-Elementary & Secondary School Improvement"},null,"350060","060-Transitional Bilingual Instruction",null,null,null,null,null,null,null,null,null,"057","001-7","057001-7",0]
[null,"080-Office of the Lieutenant Governor","001-1 General Fund-State",{"$f":"LEFT(ActiveFunds!$C45,5)","v":"001-1"},{"$f":"IFERROR(IF(VLOOKUP(D45,#REF!,2,0)=\"O\",0,IF(VLOOKUP(D45,#REF!,2,0)=\"T\",1,0)),\"ERROR\")","v":"ERROR"},"140",42,"140-Department of Revenue","140","042-1","042-1 Char/Ed/Penal/Reform/Institutions-State",null,1,"350","035","O",false,"Institutional Education",{"$f":"ActiveFunds!$O45&\"-\"&ActiveFunds!$R45","v":"035-Institutional Education"},null,"350061","061-Learning Assistance Program (LAP)",null,null,null,null,null,null,null,null,null,"057","16A-1","05716A-1",0]
[null,"080-Office of the Lieutenant Governor","001-7 General Fund-Private/Local",{"$f":"LEFT(ActiveFunds!$C46,5)","v":"001-7"},{"$f":"IFERROR(IF(VLOOKUP(D46,#REF!,2,0)=\"O\",0,IF(VLOOKUP(D46,#REF!,2,0)=\"T\",1,0)),\"ERROR\")","v":"ERROR"},"142",43,"142-Board of Tax Appeals","142","044-1","044-1 Waste Reduct/Recycle/Litter Control-State",null,1,"350","045","O",false,"Education of Highly Capable Students",{"$f":"ActiveFunds!$O46&\"-\"&ActiveFunds!$R46","v":"045-Education of Highly Capable Students"},null,"350068","068-Public School Apportionment",null,null,null,null,null,null,null,null,null,"057","17L-6","05717L-6",0]
[null,"080-Office of the Lieutenant Governor","03K-6 Industrial Insurance Premium Refund-Non-Appropriated",{"$f":"LEFT(ActiveFunds!$C47,5)","v":"03K-6"},{"$f":"IFERROR(IF(VLOOKUP(D47,#REF!,2,0)=\"O\",0,IF(VLOOKUP(D47,#REF!,2,0)=\"T\",1,0)),\"ERROR\")","v":"ERROR"},"147",44,"147-Minority & Women's Business Enterp","147","045-1","045-1 State Vehicle Parking Account-State",null,1,"350","055","O",false,"Education Reform",{"$f":"ActiveFunds!$O47&\"-\"&ActiveFunds!$R47","v":"055-Education Reform"},null,"350714","714-Compensation Adjustments",null,null,null,null,null,null,null,null,null,"075","001-1","075001-1",0]
[null,"080-Office of the Lieutenant Governor","07L-6 Legislative International Trade-Non-Appropriated",{"$f":"LEFT(ActiveFunds!$C48,5)","v":"07L-6"},{"$f":"IFERROR(IF(VLOOKUP(D48,#REF!,2,0)=\"O\",0,IF(VLOOKUP(D48,#REF!,2,0)=\"T\",1,0)),\"ERROR\")","v":"ERROR"},"160",45,"160-Office of Insurance Commissioner","160","045-6","045-6 State Vehicle Parking Account-Non-Appropriated",null,1,"350","060","O",false,"Transitional Bilingual Instruction",{"$f":"ActiveFunds!$O48&\"-\"&ActiveFunds!$R48","v":"060-Transitional Bilingual Instruction"},null,"405B00","B00-Program B - Toll Operations & Maintenance",null,null,null,null,null,null,null,null,null,"075","09R-1","07509R-1",0]
[null,"082-Public Disclosure Commission","001-1 General Fund-State",{"$f":"LEFT(ActiveFunds!$C49,5)","v":"001-1"},{"$f":"IFERROR(IF(VLOOKUP(D49,#REF!,2,0)=\"O\",0,IF(VLOOKUP(D49,#REF!,2,0)=\"T\",1,0)),\"ERROR\")","v":"ERROR"},"163",46,"163-Consolidated Technology Services","163","048-1","048-1 Marine Fuel Tax Refund Account-State",null,1,"350","061","O",false,"Learning Assistance Program (LAP)",{"$f":"ActiveFunds!$O49&\"-\"&ActiveFunds!$R49","v":"061-Learning Assistance Program (LAP)"},null,"405C00","C00-Program C - Information Technology",null,null,null,null,null,null,null,null,null,"076","001-1","076001-1",0]
[null,"082-Public Disclosure Commission","03K-6 Industrial Insurance Premium Refund-Non-Appropriated",{"$f":"LEFT(ActiveFunds!$C50,5)","v":"03K-6"},{"$f":"IFERROR(IF(VLOOKUP(D50,#REF!,2,0)=\"O\",0,IF(VLOOKUP(D50,#REF!,2,0)=\"T\",1,0)),\"ERROR\")","v":"ERROR"},"165",47,"165-State Board of Accountancy","165","04E-1","04E-1 Uniform Commercial Code Account-State",null,1,"350","068","O",false,"Public School Apportionment",{"$f":"ActiveFunds!$O50&\"-\"&ActiveFunds!$R50","v":"068-Public School Apportionment"},null,"405D00","D00-Program D - Facilities - Operating",null,null,null,null,null,null,null,null,null,"076","001-2","076001-2",0]
[null,"082-Public Disclosure Commission","447-6 Info Tech Invest Rev Acct-Non-Appropriated",{"$f":"LEFT(ActiveFunds!$C51,5)","v":"447-6"},{"$f":"IFERROR(IF(VLOOKUP(D51,#REF!,2,0)=\"O\",0,IF(VLOOKUP(D51,#REF!,2,0)=\"T\",1,0)),\"ERROR\")","v":"ERROR"},"167",48,"167-Forensic Investigations Council","167","04F-1","04F-1 Real Estate Education Program Acct-State",null,1,"350","714","O",false,"Compensation Adjustments",{"$f":"ActiveFunds!$O51&\"-\"&ActiveFunds!$R51","v":"714-Compensation Adjustments"},null,"405E00","E00-Program E - Transportation Equipment Fund",null,null,null,null,null,null,null,null,null,"076","001-7","076001-7",0]
[null,"085-Office of the Secretary of State","001-1 General Fund-State",{"$f":"LEFT(ActiveFunds!$C52,5)","v":"001-1"},{"$f":"IFERROR(IF(VLOOKUP(D52,#REF!,2,0)=\"O\",0,IF(VLOOKUP(D52,#REF!,2,0)=\"T\",1,0)),\"ERROR\")","v":"ERROR"},"179",49,"179-Dept of Enterprise Services","179","04H-1","04H-1 Surface Mining Reclamation Account-State",null,1,"405","B00","T",false,"Program B - Toll Operations & Maintenance",{"$f":"ActiveFunds!$O52&\"-\"&ActiveFunds!$R52","v":"B00-Program B - Toll Operations & Maintenance"},null,"405F00","F00-Program F - Aviation",null,null,null,null,null,null,null,null,null,"076","001-A","076001-A",0]
[null,"085-Office of the Secretary of State","001-2 General Fund-Federal",{"$f":"LEFT(ActiveFunds!$C53,5)","v":"001-2"},{"$f":"IFERROR(IF(VLOOKUP(D53,#REF!,2,0)=\"O\",0,IF(VLOOKUP(D53,#REF!,2,0)=\"T\",1,0)),\"ERROR\")","v":"ERROR"},"185",50,"185-Washington Horse Racing Commission","185","04M-1","04M-1 Recreational Fisheries Enhancement-State",null,1,"405","C00","T",false,"Program C - Information Technology",{"$f":"ActiveFunds!$O53&\"-\"&ActiveFunds!$R53","v":"C00-Program C - Information Technology"},null,"405G00","G00-Program G - Local Climate Initiatives",null,null,null,null,null,null,null,null,null,"076","001-C","076001-C",0]
[null,"085-Office of the Secretary of State","001-3 General Fund-Federal Unanticipated",{"$f":"LEFT(ActiveFunds!$C54,5)","v":"001-3"},{"$f":"IFERROR(IF(VLOOKUP(D54,#REF!,2,0)=\"O\",0,IF(VLOOKUP(D54,#REF!,2,0)=\"T\",1,0)),\"ERROR\")","v":"ERROR"},"190",51,"190-Bd of Industrial Insurance Appeals","190","04R-1","04R-1 Drinking Water Assistance Account-State",null,1,"405","D00","T",false,"Program D - Facilities - Operating",{"$f":"ActiveFunds!$O54&\"-\"&ActiveFunds!$R54","v":"D00-Program D - Facilities - Operating"},null,"405H00","H00-Program H - Program Delivery Management & Support",null,null,null,null,null,null,null,null,null,"076","039-1","076039-1",0]
[null,"085-Office of the Secretary of State","001-9 General Fund-Private/Local Unanticipated",{"$f":"LEFT(ActiveFunds!$C55,5)","v":"001-9"},{"$f":"IFERROR(IF(VLOOKUP(D55,#REF!,2,0)=\"O\",0,IF(VLOOKUP(D55,#REF!,2,0)=\"T\",1,0)),\"ERROR\")","v":"ERROR"},"195",52,"195-Liquor and Cannabis Board","195","04R-2","04R-2 Drinking Water Assistance Account-Federal",null,1,"405","E00","T",false,"Program E - Transportation Equipment Fund",{"$f":"ActiveFunds!$O55&\"-\"&ActiveFunds!$R55","v":"E00-Program E - Transportation Equipment Fund"},null,"405I","I-Program I - Highway Construction/Improvements",null,null,null,null,null,null,null,null,null,"076","042-1","076042-1",0]
[null,"085-Office of the Secretary of State","006-1 Public Records Effic/Presrv/Access-State",{"$f":"LEFT(ActiveFunds!$C56,5)","v":"006-1"},{"$f":"IFERROR(IF(VLOOKUP(D56,#REF!,2,0)=\"O\",0,IF(VLOOKUP(D56,#REF!,2,0)=\"T\",1,0)),\"ERROR\")","v":"ERROR"},"205",53,"205-Board of Pilotage Commissioners","205","04V-1","04V-1 Vehicle License Fraud Account-State",null,1,"405","F00","T",false,"Program F - Aviation",{"$f":"ActiveFunds!$O56&\"-\"&ActiveFunds!$R56","v":"F00-Program F - Aviation"},null,"405K00","K00-Program K - Public/Private Partnerships",null,null,null,null,null,null,null,null,null,"076","044-1","076044-1",0]
[null,"085-Office of the Secretary of State","06H-6 WA State Legacy Project Account-Non-Appropriated",{"$f":"LEFT(ActiveFunds!$C57,5)","v":"06H-6"},{"$f":"IFERROR(IF(VLOOKUP(D57,#REF!,2,0)=\"O\",0,IF(VLOOKUP(D57,#REF!,2,0)=\"T\",1,0)),\"ERROR\")","v":"ERROR"},"215",54,"215-Utilities and Transportation Comm","215","04W-1","04W-1 Waterworks Operator Certification-State",null,1,"405","G00","T",false,"Program G - Local Climate Initiatives",{"$f":"ActiveFunds!$O57&\"-\"&ActiveFunds!$R57","v":"G00-Program G - Local Climate Initiatives"},null,"405M00","M00-Program M - Highway Maintenance",null,null,null,null,null,null,null,null,null,"076","057-1","076057-1",0]
[null,"085-Office of the Secretary of State","12M-1 Charitable Organization Ed Acct-State",{"$f":"LEFT(ActiveFunds!$C58,5)","v":"12M-1"},{"$f":"IFERROR(IF(VLOOKUP(D58,#REF!,2,0)=\"O\",0,IF(VLOOKUP(D58,#REF!,2,0)=\"T\",1,0)),\"ERROR\")","v":"ERROR"},"220",55,"220-Board for Volunteer Firefighters","220","058-1","058-1 Public Works Assistance Account-State",null,1,"405","H00","T",false,"Program H - Program Delivery Management & Support",{"$f":"ActiveFunds!$O58&\"-\"&ActiveFunds!$R58","v":"H00-Program H - Program Delivery Management & Support"},null,"405P","P-Program P - Highway Construction/Preservation",null,null,null,null,null,null,null,null,null,"076","061-1","076061-1",0]
[null,"085-Office of the Secretary of State","14E-1 WA State Heritage Center Account-State",{"$f":"LEFT(ActiveFunds!$C59,5)","v":"14E-1"},{"$f":"IFERROR(IF(VLOOKUP(D59,#REF!,2,0)=\"O\",0,IF(VLOOKUP(D59,#REF!,2,0)=\"T\",1,0)),\"ERROR\")","v":"ERROR"},"225",56,"225-Washington State Patrol","225","05C-1","05C-1 Criminal Justice Treatment Account-State",null,1,"405","I","T",true,"Program I - Highway Construction/Improvements",{"$f":"ActiveFunds!$O59&\"-\"&ActiveFunds!$R59","v":"I-Program I - Highway Construction/Improvements"},null,"405Q00","Q00-Program Q - Traffic Operations",null,null,null,null,null,null,null,null,null,"076","062-1","076062-1",0]
[null,"085-Office of the Secretary of State","16F-6 Washington State Flag Account-Non-Appropriated",{"$f":"LEFT(ActiveFunds!$C60,5)","v":"16F-6"},{"$f":"IFERROR(IF(VLOOKUP(D60,#REF!,2,0)=\"O\",0,IF(VLOOKUP(D60,#REF!,2,0)=\"T\",1,0)),\"ERROR\")","v":"ERROR"},"227",57,"227-Criminal Justice Training Comm","227","05H-1","05H-1 Disaster Response Account-State",null,1,"405","K00","T",false,"Program K - Public/Private Partnerships",{"$f":"ActiveFunds!$O60&\"-\"&ActiveFunds!$R60","v":"K00-Program K - Public/Private Partnerships"},null,"405S00","S00-Program S - Transportation Management - Operating",null,null,null,null,null,null,null,null,null,"076","063-1","076063-1",0]
[null,"085-Office of the Secretary of State","407-6 Secretary of State's Revolving Acct-Non-Appropriated",{"$f":"LEFT(ActiveFunds!$C61,5)","v":"407-6"},{"$f":"IFERROR(IF(VLOOKUP(D61,#REF!,2,0)=\"O\",0,IF(VLOOKUP(D61,#REF!,2,0)=\"T\",1,0)),\"ERROR\")","v":"ERROR"},"228",58,"228-WA Traffic Safety Commission","228","05H-2","05H-2 Disaster Response Account-Federal",null,1,"405","M00","T",false,"Program M - Highway Maintenance",{"$f":"ActiveFunds!$O61&\"-\"&ActiveFunds!$R61","v":"M00-Program M - Highway Maintenance"},null,"405T00","T00-Program T - Transportation Planning, Data and Research - Op",null,null,null,null,null,null,null,null,null,"076","065-1","076065-1",0]
[null,"085-Office of the Secretary of State","441-1 Local Government Archives Account-State",{"$f":"LEFT(ActiveFunds!$C62,5)","v":"441-1"},{"$f":"IFERROR(IF(VLOOKUP(D62,#REF!,2,0)=\"O\",0,IF(VLOOKUP(D62,#REF!,2,0)=\"T\",1,0)),\"ERROR\")","v":"ERROR"},"235",59,"235-Department of Labor and Industries","235","05R-1","05R-1 Drinking Water Assist Admin Acct-State",null,1,"405","P","T",true,"Program P - Highway Construction/Preservation",{"$f":"ActiveFunds!$O62&\"-\"&ActiveFunds!$R62","v":"P-Program P - Highway Construction/Preservation"},null,"405U00","U00-Program U - Charges from Other Agencies",null,null,null,null,null,null,null,null,null,"076","066-1","076066-1",0]
[null,"085-Office of the Secretary of State","470-6 Imaging Account-Non-Appropriated",{"$f":"LEFT(ActiveFunds!$C63,5)","v":"470-6"},{"$f":"IFERROR(IF(VLOOKUP(D63,#REF!,2,0)=\"O\",0,IF(VLOOKUP(D63,#REF!,2,0)=\"T\",1,0)),\"ERROR\")","v":"ERROR"},"240",60,"240-Department of Licensing","240","05W-1","05W-1 State Drought Preparedness-State",null,1,"405","Q00","T",false,"Program Q - Traffic Operations",{"$f":"ActiveFunds!$O63&\"-\"&ActiveFunds!$R63","v":"Q00-Program Q - Traffic Operations"},null,"405V00","V00-Program V - Public Transportation",null,null,null,null,null,null,null,null,null,"076","081-1","076081-1",0]
[null,"085-Office of the Secretary of State","549-2 Election Account-Federal",{"$f":"LEFT(ActiveFunds!$C64,5)","v":"549-2"},{"$f":"IFERROR(IF(VLOOKUP(D64,#REF!,2,0)=\"O\",0,IF(VLOOKUP(D64,#REF!,2,0)=\"T\",1,0)),\"ERROR\")","v":"ERROR"},"245",61,"245-Military Department","245","060-1","060-1 Comm/Tech Col Capital Projects Acct-State",null,1,"405","S00","T",false,"Program S - Transportation Management - Operating",{"$f":"ActiveFunds!$O64&\"-\"&ActiveFunds!$R64","v":"S00-Program S - Transportation Management - Operating"},null,"405X00","X00-Program X - Washington State Ferries - Operating",null,null,null,null,null,null,null,null,null,"076","082-1","076082-1",0]
[null,"086-Governor's Office of Indian Affairs","001-1 General Fund-State",{"$f":"LEFT(ActiveFunds!$C65,5)","v":"001-1"},{"$f":"IFERROR(IF(VLOOKUP(D65,#REF!,2,0)=\"O\",0,IF(VLOOKUP(D65,#REF!,2,0)=\"T\",1,0)),\"ERROR\")","v":"ERROR"},"275",62,"275-Public Employment Relations Comm","275","06G-1","06G-1 Real Estate Appraiser Comm Acct-State",null,1,"405","T00","T",false,"Program T - Transportation Planning, Data and Research - Op",{"$f":"ActiveFunds!$O65&\"-\"&ActiveFunds!$R65","v":"T00-Program T - Transportation Planning, Data and Research - Op"},null,"405Y00","Y00-Program Y - Rail - Operating",null,null,null,null,null,null,null,null,null,"076","08N-6","07608N-6",0]
[null,"087-Asian-Pacific-American Affrs","001-1 General Fund-State",{"$f":"LEFT(ActiveFunds!$C66,5)","v":"001-1"},{"$f":"IFERROR(IF(VLOOKUP(D66,#REF!,2,0)=\"O\",0,IF(VLOOKUP(D66,#REF!,2,0)=\"T\",1,0)),\"ERROR\")","v":"ERROR"},"300",63,"300-Dept of Social and Health Services","300","06H-6","06H-6 WA State Legacy Project Account-Non-Appropriated",null,1,"405","U00","T",false,"Program U - Charges from Other Agencies",{"$f":"ActiveFunds!$O66&\"-\"&ActiveFunds!$R66","v":"U00-Program U - Charges from Other Agencies"},null,"405Z00","Z00-Program Z - Local Programs - Operating",null,null,null,null,null,null,null,null,null,"076","099-1","076099-1",0]
[null,"090-Office of the State Treasurer","001-1 General Fund-State",{"$f":"LEFT(ActiveFunds!$C67,5)","v":"001-1"},{"$f":"IFERROR(IF(VLOOKUP(D67,#REF!,2,0)=\"O\",0,IF(VLOOKUP(D67,#REF!,2,0)=\"T\",1,0)),\"ERROR\")","v":"ERROR"},"303",64,"303-Department of Health","303","06J-6","06J-6 Securities Prosecution Account-Non-Appropriated",null,1,"405","V00","T",false,"Program V - Public Transportation",{"$f":"ActiveFunds!$O67&\"-\"&ActiveFunds!$R67","v":"V00-Program V - Public Transportation"},null,"406010","010-Operating",null,null,null,null,null,null,null,null,null,"076","09F-1","07609F-1",0]
[null,"090-Office of the State Treasurer","404-1 State Treasurer's Service Account-State",{"$f":"LEFT(ActiveFunds!$C68,5)","v":"404-1"},{"$f":"IFERROR(IF(VLOOKUP(D68,#REF!,2,0)=\"O\",0,IF(VLOOKUP(D68,#REF!,2,0)=\"T\",1,0)),\"ERROR\")","v":"ERROR"},"305",65,"305-Department of Veterans' Affairs",{"$f":"LEFT(H68,3)","v":"305"},"06K-1","06K-1 Lead Paint Account-State",null,1,"405","X00","T",false,"Program X - Washington State Ferries - Operating",{"$f":"ActiveFunds!$O68&\"-\"&ActiveFunds!$R68","v":"X00-Program X - Washington State Ferries - Operating"},null,"407010","010-Operating",null,null,null,null,null,null,null,null,null,"076","09H-1","07609H-1",0]
[null,"090-Office of the State Treasurer","523-6 Public Funds Investment Account-Non-Appropriated",{"$f":"LEFT(ActiveFunds!$C69,5)","v":"523-6"},{"$f":"IFERROR(IF(VLOOKUP(D69,#REF!,2,0)=\"O\",0,IF(VLOOKUP(D69,#REF!,2,0)=\"T\",1,0)),\"ERROR\")","v":"ERROR"},"310",66,"307-Dept of Children, Youth & Families","307",{"$f":"MID(K69,1,5)","v":"06L-1"},"06L-1 Business & Professions Account-State",null,null,"405","Y00","T",false,"Program Y - Rail - Operating",{"$f":"ActiveFunds!$O69&\"-\"&ActiveFunds!$R69","v":"Y00-Program Y - Rail - Operating"},null,null,null,null,null,null,null,null,null,null,null,null,"076","104-1","076104-1",0]
[null,"095-Office of the State Auditor","001-1 General Fund-State",{"$f":"LEFT(ActiveFunds!$C70,5)","v":"001-1"},{"$f":"IFERROR(IF(VLOOKUP(D70,#REF!,2,0)=\"O\",0,IF(VLOOKUP(D70,#REF!,2,0)=\"T\",1,0)),\"ERROR\")","v":"ERROR"},"315",67,"310-Department of Corrections","310","06R-1","06R-1 Real Estate Research Account-State",null,null,"405","Z00","T",false,"Program Z - Local Programs - Operating",{"$f":"ActiveFunds!$O70&\"-\"&ActiveFunds!$R70","v":"Z00-Program Z - Local Programs - Operating"},null,null,null,null,null,null,null,null,null,null,null,null,"076","106-1",{"$f":"AF70&AG70","v":"076106-1"},0]
[null,"095-Office of the State Auditor","413-6 Municipal Revolving Account-Non-Appropriated",{"$f":"LEFT(ActiveFunds!$C71,5)","v":"413-6"},{"$f":"IFERROR(IF(VLOOKUP(D71,#REF!,2,0)=\"O\",0,IF(VLOOKUP(D71,#REF!,2,0)=\"T\",1,0)),\"ERROR\")","v":"ERROR"},"340",68,"315-Dept of Services for the Blind","315","06T-1","06T-1 License Plate Technology Account-State",null,null,"406","010","T",false,"Operating",{"$f":"ActiveFunds!$O71&\"-\"&ActiveFunds!$R71","v":"010-Operating"},null,null,null,null,null,null,null,null,null,null,null,null,"076","108-1","076108-1",0]
[null,"095-Office of the State Auditor","483-1 Auditing Services Revolving Acct-State",{"$f":"LEFT(ActiveFunds!$C72,5)","v":"483-1"},{"$f":"IFERROR(IF(VLOOKUP(D72,#REF!,2,0)=\"O\",0,IF(VLOOKUP(D72,#REF!,2,0)=\"T\",1,0)),\"ERROR\")","v":"ERROR"},"341",69,"340-Student Achievement Council","340","071-1","071-1 Warm Water Game Fish Account-State",null,null,"407","010","T",false,"Operating",{"$f":"ActiveFunds!$O72&\"-\"&ActiveFunds!$R72","v":"010-Operating"},null,null,null,null,null,null,null,null,null,null,null,null,"076","109-1","076109-1",0]
[null,"095-Office of the State Auditor","553-1 Performance Audits of Govt Acct-State",{"$f":"LEFT(ActiveFunds!$C73,5)","v":"553-1"},{"$f":"IFERROR(IF(VLOOKUP(D73,#REF!,2,0)=\"O\",0,IF(VLOOKUP(D73,#REF!,2,0)=\"T\",1,0)),\"ERROR\")","v":"ERROR"},"350",70,"341-LEOFF 2 Retirement Board","341","072-1","072-1 St/Loc Impr Rev Acct Water Sup Fac-State",null,null,"411","010","T",false,"",{"$f":"ActiveFunds!$O73&\"-\"&ActiveFunds!$R73","v":"010-"},null,null,null,null,null,null,null,null,null,null,null,null,"076","10P-1","07610P-1",0]
[null,"095-Office of the State Auditor","553-6 Performance Audits of Govt Acct-Non-Appropriated",{"$f":"LEFT(ActiveFunds!$C74,5)","v":"553-6"},{"$f":"IFERROR(IF(VLOOKUP(D74,#REF!,2,0)=\"O\",0,IF(VLOOKUP(D74,#REF!,2,0)=\"T\",1,0)),\"ERROR\")","v":"ERROR"},"351",71,"350-Public Schools","350","07A-6","07A-6 Mortgage Lending Fraud Pros Account-Non-Appropriated",null,null,null,null,null,null,null,null,null,null,null,null,null,null,null,null,null,null,null,null,"076","125-1","076125-1",0]
[null,"099-Comm Salaries for Elected Officials","001-1 General Fund-State",{"$f":"LEFT(ActiveFunds!$C75,5)","v":"001-1"},{"$f":"IFERROR(IF(VLOOKUP(D75,#REF!,2,0)=\"O\",0,IF(VLOOKUP(D75,#REF!,2,0)=\"T\",1,0)),\"ERROR\")","v":"ERROR"},"353",72,"351-State School for the Blind","351","07E-6","07E-6 Contract Harvesting Revolving Acct-Non-Appropriated",null,null,null,null,null,null,null,null,null,null,null,null,null,null,null,null,null,null,null,null,"076","15H-1","07615H-1",0]
[null,"099-Comm Salaries for Elected Officials","03K-6 Industrial Insurance Premium Refund-Non-Appropriated",{"$f":"LEFT(ActiveFunds!$C76,5)","v":"03K-6"},{"$f":"IFERROR(IF(VLOOKUP(D76,#REF!,2,0)=\"O\",0,IF(VLOOKUP(D76,#REF!,2,0)=\"T\",1,0)),\"ERROR\")","v":"ERROR"},"354",73,"353-Childhood Deafness & Hearing Loss","353","07L-6","07L-6 Legislative International Trade-Non-Appropriated",null,null,null,null,null,null,null,null,null,null,null,null,null,null,null,null,null,null,null,null,"076","16J-1","07616J-1",0]
[null,"100-Office of the Attorney General","001-1 General Fund-State",{"$f":"LEFT(ActiveFunds!$C77,5)","v":"001-1"},{"$f":"IFERROR(IF(VLOOKUP(D77,#REF!,2,0)=\"O\",0,IF(VLOOKUP(D77,#REF!,2,0)=\"T\",1,0)),\"ERROR\")","v":"ERROR"},"355",74,"354-Workforce Trng & Educ Coord Board","354","07V-6","07V-6 Fish & Wildlife Enforcement Reward-Non-Appropriated",null,null,null,null,null,null,null,null,null,null,null,null,null,null,null,null,null,null,null,null,"076","173-1","076173-1",0]
[null,"100-Office of the Attorney General","001-2 General Fund-Federal",{"$f":"LEFT(ActiveFunds!$C78,5)","v":"001-2"},{"$f":"IFERROR(IF(VLOOKUP(D78,#REF!,2,0)=\"O\",0,IF(VLOOKUP(D78,#REF!,2,0)=\"T\",1,0)),\"ERROR\")","v":"ERROR"},"357",75,"355-Archaeology & Historic Preservation","355","07W-1","07W-1 Domestic Violence Prevention Acct-State",null,null,null,null,null,null,null,null,null,null,null,null,null,null,null,null,null,null,null,null,"076","174-1","076174-1",0]
[null,"100-Office of the Attorney General","111-1 Public Service Revolving Account-State",{"$f":"LEFT(ActiveFunds!$C79,5)","v":"111-1"},{"$f":"IFERROR(IF(VLOOKUP(D79,#REF!,2,0)=\"O\",0,IF(VLOOKUP(D79,#REF!,2,0)=\"T\",1,0)),\"ERROR\")","v":"ERROR"},"359",76,"357-Department of Early Learning","357","080-1","080-1 Grade Crossing Protective Account-State",null,null,null,null,null,null,null,null,null,null,null,null,null,null,null,null,null,null,null,null,"076","176-1","076176-1",0]
[null,"100-Office of the Attorney General","12F-6 Manufactured/Mobile Home Dispute-Non-Appropriated",{"$f":"LEFT(ActiveFunds!$C80,5)","v":"12F-6"},{"$f":"IFERROR(IF(VLOOKUP(D80,#REF!,2,0)=\"O\",0,IF(VLOOKUP(D80,#REF!,2,0)=\"T\",1,0)),\"ERROR\")","v":"ERROR"},"360",77,"359-Washington Charter School Comm","359","081-1","081-1 State Patrol Highway Account-State",null,null,null,null,null,null,null,null,null,null,null,null,null,null,null,null,null,null,null,null,"076","19G-1","07619G-1",0]
[null,"100-Office of the Attorney General","154-1 New Motor Vehicle Arbitration Acct-State",{"$f":"LEFT(ActiveFunds!$C81,5)","v":"154-1"},{"$f":"IFERROR(IF(VLOOKUP(D81,#REF!,2,0)=\"O\",0,IF(VLOOKUP(D81,#REF!,2,0)=\"T\",1,0)),\"ERROR\")","v":"ERROR"},"365",78,"360-University of Washington","360","081-2","081-2 State Patrol Highway Account-Federal",null,null,null,null,null,null,null,null,null,null,null,null,null,null,null,null,null,null,null,null,"076","207-1","076207-1",0]
[null,"100-Office of the Attorney General","17L-6 Foreclosure Fairness Account-Non-Appropriated",{"$f":"LEFT(ActiveFunds!$C82,5)","v":"17L-6"},{"$f":"IFERROR(IF(VLOOKUP(D82,#REF!,2,0)=\"O\",0,IF(VLOOKUP(D82,#REF!,2,0)=\"T\",1,0)),\"ERROR\")","v":"ERROR"},"370",79,"365-Washington State University","365","081-7","081-7 State Patrol Highway Account-Private/Local",null,null,null,null,null,null,null,null,null,null,null,null,null,null,null,null,null,null,null,null,"076","20K-6","07620K-6",0]
[null,"100-Office of the Attorney General","19A-1 Medicaid Fraud Penalty Account-State",{"$f":"LEFT(ActiveFunds!$C83,5)","v":"19A-1"},{"$f":"IFERROR(IF(VLOOKUP(D83,#REF!,2,0)=\"O\",0,IF(VLOOKUP(D83,#REF!,2,0)=\"T\",1,0)),\"ERROR\")","v":"ERROR"},"375",80,"370-Eastern Washington University","370","082-1","082-1 Motorcycle Safety Education Account-State",null,null,null,null,null,null,null,null,null,null,null,null,null,null,null,null,null,null,null,null,"076","20R-1","07620R-1",0]
[null,"100-Office of the Attorney General","19P-1 Child Rescue Fund-State",{"$f":"LEFT(ActiveFunds!$C84,5)","v":"19P-1"},{"$f":"IFERROR(IF(VLOOKUP(D84,#REF!,2,0)=\"O\",0,IF(VLOOKUP(D84,#REF!,2,0)=\"T\",1,0)),\"ERROR\")","v":"ERROR"},"376",81,"375-Central Washington University","375","084-1","084-1 Building Code Council Account-State",null,null,null,null,null,null,null,null,null,null,null,null,null,null,null,null,null,null,null,null,"076","215-1","076215-1",0]
[null,"100-Office of the Attorney General","405-1 Legal Services Revolving Account-State",{"$f":"LEFT(ActiveFunds!$C85,5)","v":"405-1"},{"$f":"IFERROR(IF(VLOOKUP(D85,#REF!,2,0)=\"O\",0,IF(VLOOKUP(D85,#REF!,2,0)=\"T\",1,0)),\"ERROR\")","v":"ERROR"},"380",82,"376-The Evergreen State College","376","086-1","086-1 Fire Service Training Account-State",null,null,null,null,null,null,null,null,null,null,null,null,null,null,null,null,null,null,null,null,"076","217-1","076217-1",0]
[null,"100-Office of the Attorney General","424-6 Anti-Trust Revolving Account-Non-Appropriated",{"$f":"LEFT(ActiveFunds!$C86,5)","v":"424-6"},{"$f":"IFERROR(IF(VLOOKUP(D86,#REF!,2,0)=\"O\",0,IF(VLOOKUP(D86,#REF!,2,0)=\"T\",1,0)),\"ERROR\")","v":"ERROR"},"387",83,"380-Western Washington University","380","087-6","087-6 Park Land Trust Revolving Account-Non-Appropriated",null,null,null,null,null,null,null,null,null,null,null,null,null,null,null,null,null,null,null,null,"076","218-1","076218-1",0]
[null,"100-Office of the Attorney General","759-6 Miscellaneous Program Account-Non-Appropriated",{"$f":"LEFT(ActiveFunds!$C87,5)","v":"759-6"},{"$f":"IFERROR(IF(VLOOKUP(D87,#REF!,2,0)=\"O\",0,IF(VLOOKUP(D87,#REF!,2,0)=\"T\",1,0)),\"ERROR\")","v":"ERROR"},"390",84,"387-Washington State Arts Commission","387","08A-1","08A-1 Education Legacy Trust Account-State",null,null,null,null,null,null,null,null,null,null,null,null,null,null,null,null,null,null,null,null,"076","252-6","076252-6",0]
[null,"100-Office of the Attorney General","828-1 Tobacco Prevention and Control Acct-State",{"$f":"LEFT(ActiveFunds!$C88,5)","v":"828-1"},{"$f":"IFERROR(IF(VLOOKUP(D88,#REF!,2,0)=\"O\",0,IF(VLOOKUP(D88,#REF!,2,0)=\"T\",1,0)),\"ERROR\")","v":"ERROR"},"395",85,"390-Washington State Historical Society","390","08E-6","08E-6 Individual Development Account Prog-Non-Appropriated",null,null,null,null,null,null,null,null,null,null,null,null,null,null,null,null,null,null,null,null,"076","253-1","076253-1",0]
[null,"101-Caseload Forecast Council","001-1 General Fund-State",{"$f":"LEFT(ActiveFunds!$C89,5)","v":"001-1"},{"$f":"IFERROR(IF(VLOOKUP(D89,#REF!,2,0)=\"O\",0,IF(VLOOKUP(D89,#REF!,2,0)=\"T\",1,0)),\"ERROR\")","v":"ERROR"},"405",86,"395-East Wash State Historical Society","395","08G-6","08G-6 Flexible Spending Admin Acct-Non-Appropriated",null,null,null,null,null,null,null,null,null,null,null,null,null,null,null,null,null,null,null,null,"076","267-1","076267-1",0]
[null,"102-Dept of Financial Institutions","06J-6 Securities Prosecution Account-Non-Appropriated",{"$f":"LEFT(ActiveFunds!$C90,5)","v":"06J-6"},{"$f":"IFERROR(IF(VLOOKUP(D90,#REF!,2,0)=\"O\",0,IF(VLOOKUP(D90,#REF!,2,0)=\"T\",1,0)),\"ERROR\")","v":"ERROR"},"406",87,"405-Department of Transportation","405","08H-1","08H-1 Military Department Rent and Lease-State",null,null,null,null,null,null,null,null,null,null,null,null,null,null,null,null,null,null,null,null,"076","268-1","076268-1",0]
[null,"102-Dept of Financial Institutions","07A-6 Mortgage Lending Fraud Pros Account-Non-Appropriated",{"$f":"LEFT(ActiveFunds!$C91,5)","v":"07A-6"},{"$f":"IFERROR(IF(VLOOKUP(D91,#REF!,2,0)=\"O\",0,IF(VLOOKUP(D91,#REF!,2,0)=\"T\",1,0)),\"ERROR\")","v":"ERROR"},"407",88,"406-County Road Administration Board","406","08J-6","08J-6 Prescription Drug Consortium Acct-Non-Appropriated",null,null,null,null,null,null,null,null,null,null,null,null,null,null,null,null,null,null,null,null,"076","289-1","076289-1",0]
[null,"102-Dept of Financial Institutions","17L-6 Foreclosure Fairness Account-Non-Appropriated",{"$f":"LEFT(ActiveFunds!$C92,5)","v":"17L-6"},{"$f":"IFERROR(IF(VLOOKUP(D92,#REF!,2,0)=\"O\",0,IF(VLOOKUP(D92,#REF!,2,0)=\"T\",1,0)),\"ERROR\")","v":"ERROR"},"410",89,"407-Transportation Improvement Board","407","08K-1","08K-1 Problem Gambling Account-State",null,null,null,null,null,null,null,null,null,null,null,null,null,null,null,null,null,null,null,null,"076","401-6","076401-6",0]
[null,"102-Dept of Financial Institutions","300-6 Financial Services Regulation Acct-Non-Appropriated",{"$f":"LEFT(ActiveFunds!$C93,5)","v":"300-6"},{"$f":"IFERROR(IF(VLOOKUP(D93,#REF!,2,0)=\"O\",0,IF(VLOOKUP(D93,#REF!,2,0)=\"T\",1,0)),\"ERROR\")","v":"ERROR"},"411",90,"410-Transportation Commission","410","08N-6","08N-6 State Financial Aid Account-Non-Appropriated",null,null,null,null,null,null,null,null,null,null,null,null,null,null,null,null,null,null,null,null,"076","403-6","076403-6",0]
[null,"103-Department of Commerce","001-1 General Fund-State",{"$f":"LEFT(ActiveFunds!$C94,5)","v":"001-1"},{"$f":"IFERROR(IF(VLOOKUP(D94,#REF!,2,0)=\"O\",0,IF(VLOOKUP(D94,#REF!,2,0)=\"T\",1,0)),\"ERROR\")","v":"ERROR"},"460",91,"411-Freight Mobility Strategic Invest","411","08P-6","08P-6 State Parks Education & Enhancement-Non-Appropriated",null,null,null,null,null,null,null,null,null,null,null,null,null,null,null,null,null,null,null,null,"076","411-6","076411-6",0]
[null,"103-Department of Commerce","001-2 General Fund-Federal",{"$f":"LEFT(ActiveFunds!$C95,5)","v":"001-2"},{"$f":"IFERROR(IF(VLOOKUP(D95,#REF!,2,0)=\"O\",0,IF(VLOOKUP(D95,#REF!,2,0)=\"T\",1,0)),\"ERROR\")","v":"ERROR"},"461",92,"460-Columbia River Gorge Commission","460","08V-6","08V-6 Veterans Stewardship Account-Non-Appropriated",null,null,null,null,null,null,null,null,null,null,null,null,null,null,null,null,null,null,null,null,"076","440-6","076440-6",0]
[null,"103-Department of Commerce","001-3 General Fund-Federal Unanticipated",{"$f":"LEFT(ActiveFunds!$C96,5)","v":"001-3"},{"$f":"IFERROR(IF(VLOOKUP(D96,#REF!,2,0)=\"O\",0,IF(VLOOKUP(D96,#REF!,2,0)=\"T\",1,0)),\"ERROR\")","v":"ERROR"},"462",93,"461-Department of Ecology","461","095-1","095-1 Electrical License Account-State",null,null,null,null,null,null,null,null,null,null,null,null,null,null,null,null,null,null,null,null,"076","443-6","076443-6",0]
[null,"103-Department of Commerce","001-7 General Fund-Private/Local",{"$f":"LEFT(ActiveFunds!$C97,5)","v":"001-7"},{"$f":"IFERROR(IF(VLOOKUP(D97,#REF!,2,0)=\"O\",0,IF(VLOOKUP(D97,#REF!,2,0)=\"T\",1,0)),\"ERROR\")","v":"ERROR"},"465",94,"462-WA Pollution Liab Insurance Program","462","098-1","098-1 East WA Pheasant Enhancement Acct-State",null,null,null,null,null,null,null,null,null,null,null,null,null,null,null,null,null,null,null,null,"076","448-6","076448-6",0]
[null,"103-Department of Commerce","03K-6 Industrial Insurance Premium Refund-Non-Appropriated",{"$f":"LEFT(ActiveFunds!$C98,5)","v":"03K-6"},{"$f":"IFERROR(IF(VLOOKUP(D98,#REF!,2,0)=\"O\",0,IF(VLOOKUP(D98,#REF!,2,0)=\"T\",1,0)),\"ERROR\")","v":"ERROR"},"467",95,"465-State Parks and Recreation Comm","465","09B-6","09B-6 Boating Safety Edu Cert Account-Non-Appropriated",null,null,null,null,null,null,null,null,null,null,null,null,null,null,null,null,null,null,null,null,"076","450-6","076450-6",0]
[null,"103-Department of Commerce","04R-1 Drinking Water Assistance Account-State",{"$f":"LEFT(ActiveFunds!$C99,5)","v":"04R-1"},{"$f":"IFERROR(IF(VLOOKUP(D99,#REF!,2,0)=\"O\",0,IF(VLOOKUP(D99,#REF!,2,0)=\"T\",1,0)),\"ERROR\")","v":"ERROR"},"468",96,"467-Rec and Conservation Funding Board","467","09F-1","09F-1 High-Occupancy Toll Lanes Op Acct-State",null,null,null,null,null,null,null,null,null,null,null,null,null,null,null,null,null,null,null,null,"076","460-6","076460-6",0]
[null,"103-Department of Commerce","058-1 Public Works Assistance Account-State",{"$f":"LEFT(ActiveFunds!$C100,5)","v":"058-1"},{"$f":"IFERROR(IF(VLOOKUP(D100,#REF!,2,0)=\"O\",0,IF(VLOOKUP(D100,#REF!,2,0)=\"T\",1,0)),\"ERROR\")","v":"ERROR"},"471",97,"468-Environ & Land Use Hearings Office","468","09H-1","09H-1 Transportation Partnership Account-State",null,null,null,null,null,null,null,null,null,null,null,null,null,null,null,null,null,null,null,null,"076","488-1","076488-1",0]
[null,"103-Department of Commerce","05R-1 Drinking Water Assist Admin Acct-State",{"$f":"LEFT(ActiveFunds!$C101,5)","v":"05R-1"},{"$f":"IFERROR(IF(VLOOKUP(D101,#REF!,2,0)=\"O\",0,IF(VLOOKUP(D101,#REF!,2,0)=\"T\",1,0)),\"ERROR\")","v":"ERROR"},"477",98,"471-State Conservation Commission","471","09J-6","09J-6 WA Coast Crab Pot Buoy Tag Account-Non-Appropriated",null,null,null,null,null,null,null,null,null,null,null,null,null,null,null,null,null,null,null,null,"076","511-1","076511-1",0]
[null,"103-Department of Commerce","06K-1 Lead Paint Account-State",{"$f":"LEFT(ActiveFunds!$C102,5)","v":"06K-1"},{"$f":"IFERROR(IF(VLOOKUP(D102,#REF!,2,0)=\"O\",0,IF(VLOOKUP(D102,#REF!,2,0)=\"T\",1,0)),\"ERROR\")","v":"ERROR"},"478",99,"477-Dept of Fish and Wildlife","477","09L-6","09L-6 Nursing Resource Center Account-Non-Appropriated",null,null,null,null,null,null,null,null,null,null,null,null,null,null,null,null,null,null,null,null,"076","512-6","076512-6",0]
[null,"103-Department of Commerce","084-1 Building Code Council Account-State",{"$f":"LEFT(ActiveFunds!$C103,5)","v":"084-1"},{"$f":"IFERROR(IF(VLOOKUP(D103,#REF!,2,0)=\"O\",0,IF(VLOOKUP(D103,#REF!,2,0)=\"T\",1,0)),\"ERROR\")","v":"ERROR"},"490",100,"478-Puget Sound Partnership","478","09M-1","09M-1 Aquatic Invasive Species Enf. Acct.-State",null,null,null,null,null,null,null,null,null,null,null,null,null,null,null,null,null,null,null,null,"076","522-6","076522-6",0]
[null,"103-Department of Commerce","08E-6 Individual Development Account Prog-Non-Appropriated",{"$f":"LEFT(ActiveFunds!$C104,5)","v":"08E-6"},{"$f":"IFERROR(IF(VLOOKUP(D104,#REF!,2,0)=\"O\",0,IF(VLOOKUP(D104,#REF!,2,0)=\"T\",1,0)),\"ERROR\")","v":"ERROR"},"495",101,"490-Department of Natural Resources","490","09N-1","09N-1 Aquatic Invasive Sp Prevention Acct-State",null,null,null,null,null,null,null,null,null,null,null,null,null,null,null,null,null,null,null,null,"076","524-6","076524-6",0]
[null,"103-Department of Commerce","09R-1 Econ Dev Strategic Reserve Account-State",{"$f":"LEFT(ActiveFunds!$C105,5)","v":"09R-1"},{"$f":"IFERROR(IF(VLOOKUP(D105,#REF!,2,0)=\"O\",0,IF(VLOOKUP(D105,#REF!,2,0)=\"T\",1,0)),\"ERROR\")","v":"ERROR"},"540",102,"495-Department of Agriculture","495","09R-1","09R-1 Econ Dev Strategic Reserve Account-State",null,null,null,null,null,null,null,null,null,null,null,null,null,null,null,null,null,null,null,null,"076","528-6","076528-6",0]
[null,"103-Department of Commerce","107-1 Liquor Excise Tax Account-State",{"$f":"LEFT(ActiveFunds!$C106,5)","v":"107-1"},{"$f":"IFERROR(IF(VLOOKUP(D106,#REF!,2,0)=\"O\",0,IF(VLOOKUP(D106,#REF!,2,0)=\"T\",1,0)),\"ERROR\")","v":"ERROR"},"699",103,"540-Employment Security Department","540","09T-6","09T-6 WA Main Street Trust Fund Account-Non-Appropriated",null,null,null,null,null,null,null,null,null,null,null,null,null,null,null,null,null,null,null,null,"076","550-1","076550-1",0]
[null,"103-Department of Commerce","10B-1 Home Security Fund Account-State",{"$f":"LEFT(ActiveFunds!$C107,5)","v":"10B-1"},{"$f":"IFERROR(IF(VLOOKUP(D107,#REF!,2,0)=\"O\",0,IF(VLOOKUP(D107,#REF!,2,0)=\"T\",1,0)),\"ERROR\")","v":"ERROR"},null,104,"699-Community/Technical College System","699","102-1","102-1 Rural Arterial Trust Account-State",null,null,null,null,null,null,null,null,null,null,null,null,null,null,null,null,null,null,null,null,"076","570-6","076570-6",0]
[null,"103-Department of Commerce","10R-1 Energy Freedom Account-State",{"$f":"LEFT(ActiveFunds!$C108,5)","v":"10R-1"},{"$f":"IFERROR(IF(VLOOKUP(D108,#REF!,2,0)=\"O\",0,IF(VLOOKUP(D108,#REF!,2,0)=\"T\",1,0)),\"ERROR\")","v":"ERROR"},null,105,null,"","104-1","104-1 State Wildlife Account-State",null,null,null,null,null,null,null,null,null,null,null,null,null,null,null,null,null,null,null,null,"076","573-6","076573-6",0]
[null,"103-Department of Commerce","12C-1 Affordable Housing For All-State",{"$f":"LEFT(ActiveFunds!$C109,5)","v":"12C-1"},{"$f":"IFERROR(IF(VLOOKUP(D109,#REF!,2,0)=\"O\",0,IF(VLOOKUP(D109,#REF!,2,0)=\"T\",1,0)),\"ERROR\")","v":"ERROR"},null,106,null,"","106-1","106-1 Highway Safety Account-State",null,null,null,null,null,null,null,null,null,null,null,null,null,null,null,null,null,null,null,null,"076","727-1","076727-1",0]
[null,"103-Department of Commerce","14M-1 Finan Frd & Id Thft Crimes Inv & Pr-State",{"$f":"LEFT(ActiveFunds!$C110,5)","v":"14M-1"},{"$f":"IFERROR(IF(VLOOKUP(D110,#REF!,2,0)=\"O\",0,IF(VLOOKUP(D110,#REF!,2,0)=\"T\",1,0)),\"ERROR\")","v":"ERROR"},null,107,null,"","106-2","106-2 Highway Safety Account-Federal",null,null,null,null,null,null,null,null,null,null,null,null,null,null,null,null,null,null,null,null,"076","846-6","076846-6",0]
[null,"103-Department of Commerce","150-1 Low-Income Weath/Struct Rehab Asst-State",{"$f":"LEFT(ActiveFunds!$C111,5)","v":"150-1"},{"$f":"IFERROR(IF(VLOOKUP(D111,#REF!,2,0)=\"O\",0,IF(VLOOKUP(D111,#REF!,2,0)=\"T\",1,0)),\"ERROR\")","v":"ERROR"},null,108,null,"","106-7","106-7 Highway Safety Account-Private/Local",null,null,null,null,null,null,null,null,null,null,null,null,null,null,null,null,null,null,null,null,"076","850-6","076850-6",0]
[null,"103-Department of Commerce","15A-6 Transitional Housing Oper & Rent-Non-Appropriated",{"$f":"LEFT(ActiveFunds!$C112,5)","v":"15A-6"},{"$f":"IFERROR(IF(VLOOKUP(D112,#REF!,2,0)=\"O\",0,IF(VLOOKUP(D112,#REF!,2,0)=\"T\",1,0)),\"ERROR\")","v":"ERROR"},null,109,null,"","106-9","106-9 Highway Safety Account-Private/Local Unanticipated",null,null,null,null,null,null,null,null,null,null,null,null,null,null,null,null,null,null,null,null,"080","001-1","080001-1",0]
[null,"103-Department of Commerce","17L-6 Foreclosure Fairness Account-Non-Appropriated",{"$f":"LEFT(ActiveFunds!$C113,5)","v":"17L-6"},{"$f":"IFERROR(IF(VLOOKUP(D113,#REF!,2,0)=\"O\",0,IF(VLOOKUP(D113,#REF!,2,0)=\"T\",1,0)),\"ERROR\")","v":"ERROR"},null,110,null,"","107-1","107-1 Liquor Excise Tax Account-State",null,null,null,null,null,null,null,null,null,null,null,null,null,null,null,null,null,null,null,null,"080","001-7","080001-7",0]
[null,"103-Department of Commerce","18A-6 Investing In Innovation Account-Non-Appropriated",{"$f":"LEFT(ActiveFunds!$C114,5)","v":"18A-6"},{"$f":"IFERROR(IF(VLOOKUP(D114,#REF!,2,0)=\"O\",0,IF(VLOOKUP(D114,#REF!,2,0)=\"T\",1,0)),\"ERROR\")","v":"ERROR"},null,null,null,null,"108-1","108-1 Motor Vehicle Account-State",null,null,null,null,null,null,null,null,null,null,null,null,null,null,null,null,null,null,null,null,"080","07L-6","08007L-6",0]
[null,"103-Department of Commerce","19V-6 Cancer Research Endow Match Transfr-Non-Appropriated",{"$f":"LEFT(ActiveFunds!$C115,5)","v":"19V-6"},{"$f":"IFERROR(IF(VLOOKUP(D115,#REF!,2,0)=\"O\",0,IF(VLOOKUP(D115,#REF!,2,0)=\"T\",1,0)),\"ERROR\")","v":"ERROR"},null,null,null,null,"108-2","108-2 Motor Vehicle Account-Federal",null,null,null,null,null,null,null,null,null,null,null,null,null,null,null,null,null,null,null,null,"082","001-1","082001-1",0]
[null,"103-Department of Commerce","205-6 Mobile Home Park Relocation Account-Non-Appropriated",{"$f":"LEFT(ActiveFunds!$C116,5)","v":"205-6"},{"$f":"IFERROR(IF(VLOOKUP(D116,#REF!,2,0)=\"O\",0,IF(VLOOKUP(D116,#REF!,2,0)=\"T\",1,0)),\"ERROR\")","v":"ERROR"},null,null,null,null,"108-3","108-3 Motor Vehicle Account-Federal Unanticipated",null,null,null,null,null,null,null,null,null,null,null,null,null,null,null,null,null,null,null,null,"085","001-1","085001-1",0]
[null,"103-Department of Commerce","21C-6 Sexual Assault Kit Account-Non-Appropriated",{"$f":"LEFT(ActiveFunds!$C117,5)","v":"21C-6"},{"$f":"IFERROR(IF(VLOOKUP(D117,#REF!,2,0)=\"O\",0,IF(VLOOKUP(D117,#REF!,2,0)=\"T\",1,0)),\"ERROR\")","v":"ERROR"},null,null,null,null,"108-7","108-7 Motor Vehicle Account-Private/Local",null,null,null,null,null,null,null,null,null,null,null,null,null,null,null,null,null,null,null,null,"085","001-2","085001-2",0]
[null,"103-Department of Commerce","237-1 Recreation Access Pass Account-State",{"$f":"LEFT(ActiveFunds!$C118,5)","v":"237-1"},{"$f":"IFERROR(IF(VLOOKUP(D118,#REF!,2,0)=\"O\",0,IF(VLOOKUP(D118,#REF!,2,0)=\"T\",1,0)),\"ERROR\")","v":"ERROR"},null,null,null,null,"109-1","109-1 Puget Sound Ferry Operations Acct-State",null,null,null,null,null,null,null,null,null,null,null,null,null,null,null,null,null,null,null,null,"085","006-1","085006-1",0]
[null,"103-Department of Commerce","263-1 Community/Economic Development Fee-State",{"$f":"LEFT(ActiveFunds!$C119,5)","v":"263-1"},{"$f":"IFERROR(IF(VLOOKUP(D119,#REF!,2,0)=\"O\",0,IF(VLOOKUP(D119,#REF!,2,0)=\"T\",1,0)),\"ERROR\")","v":"ERROR"},null,null,null,null,"109-2","109-2 Puget Sound Ferry Operations Acct-Federal",null,null,null,null,null,null,null,null,null,null,null,null,null,null,null,null,null,null,null,null,"085","06H-6","08506H-6",0]
[null,"103-Department of Commerce","300-1 Financial Services Regulation Acct-State",{"$f":"LEFT(ActiveFunds!$C120,5)","v":"300-1"},{"$f":"IFERROR(IF(VLOOKUP(D120,#REF!,2,0)=\"O\",0,IF(VLOOKUP(D120,#REF!,2,0)=\"T\",1,0)),\"ERROR\")","v":"ERROR"},null,null,null,null,"109-7","109-7 Puget Sound Ferry Operations Acct-Private/Local",null,null,null,null,null,null,null,null,null,null,null,null,null,null,null,null,null,null,null,null,"085","12M-1","08512M-1",0]
[null,"103-Department of Commerce","501-1 Liquor Revolving Account-State",{"$f":"LEFT(ActiveFunds!$C121,5)","v":"501-1"},{"$f":"IFERROR(IF(VLOOKUP(D121,#REF!,2,0)=\"O\",0,IF(VLOOKUP(D121,#REF!,2,0)=\"T\",1,0)),\"ERROR\")","v":"ERROR"},null,null,null,null,"10A-1","10A-1 Aquatic Algae Control Account-State",null,null,null,null,null,null,null,null,null,null,null,null,null,null,null,null,null,null,null,null,"085","14E-1","08514E-1",0]
[null,"103-Department of Commerce","532-1 Washington Housing Trust Account-State",{"$f":"LEFT(ActiveFunds!$C122,5)","v":"532-1"},{"$f":"IFERROR(IF(VLOOKUP(D122,#REF!,2,0)=\"O\",0,IF(VLOOKUP(D122,#REF!,2,0)=\"T\",1,0)),\"ERROR\")","v":"ERROR"},null,null,null,null,"10B-1","10B-1 Home Security Fund Account-State",null,null,null,null,null,null,null,null,null,null,null,null,null,null,null,null,null,null,null,null,"085","16F-6","08516F-6",0]
[null,"103-Department of Commerce","731-6 Child Care Facility Revolving Acct-Non-Appropriated",{"$f":"LEFT(ActiveFunds!$C123,5)","v":"731-6"},{"$f":"IFERROR(IF(VLOOKUP(D123,#REF!,2,0)=\"O\",0,IF(VLOOKUP(D123,#REF!,2,0)=\"T\",1,0)),\"ERROR\")","v":"ERROR"},null,null,null,null,"10G-1","10G-1 Water Rights Tracking System Acct-State",null,null,null,null,null,null,null,null,null,null,null,null,null,null,null,null,null,null,null,null,"085","407-6","085407-6",0]
[null,"103-Department of Commerce","746-6 Hanford Area Economic Investment-Non-Appropriated",{"$f":"LEFT(ActiveFunds!$C124,5)","v":"746-6"},{"$f":"IFERROR(IF(VLOOKUP(D124,#REF!,2,0)=\"O\",0,IF(VLOOKUP(D124,#REF!,2,0)=\"T\",1,0)),\"ERROR\")","v":"ERROR"},null,null,null,null,"10R-1","10R-1 Energy Freedom Account-State",null,null,null,null,null,null,null,null,null,null,null,null,null,null,null,null,null,null,null,null,"085","415-1","085415-1",0]
[null,"103-Department of Commerce","759-6 Miscellaneous Program Account-Non-Appropriated",{"$f":"LEFT(ActiveFunds!$C125,5)","v":"759-6"},{"$f":"IFERROR(IF(VLOOKUP(D125,#REF!,2,0)=\"O\",0,IF(VLOOKUP(D125,#REF!,2,0)=\"T\",1,0)),\"ERROR\")","v":"ERROR"},null,null,null,null,"110-1","110-1 Special Wildlife Account-State",null,null,null,null,null,null,null,null,null,null,null,null,null,null,null,null,null,null,null,null,"085","441-1","085441-1",0]
[null,"103-Department of Commerce","777-1 Prostitution Prevent & Intervention-State",{"$f":"LEFT(ActiveFunds!$C126,5)","v":"777-1"},{"$f":"IFERROR(IF(VLOOKUP(D126,#REF!,2,0)=\"O\",0,IF(VLOOKUP(D126,#REF!,2,0)=\"T\",1,0)),\"ERROR\")","v":"ERROR"},null,null,null,null,"110-2","110-2 Special Wildlife Account-Federal",null,null,null,null,null,null,null,null,null,null,null,null,null,null,null,null,null,null,null,null,"085","470-6","085470-6",0]
[null,"103-Department of Commerce","833-6 Develop Disability Endowment Trust-Non-Appropriated",{"$f":"LEFT(ActiveFunds!$C127,5)","v":"833-6"},{"$f":"IFERROR(IF(VLOOKUP(D127,#REF!,2,0)=\"O\",0,IF(VLOOKUP(D127,#REF!,2,0)=\"T\",1,0)),\"ERROR\")","v":"ERROR"},null,null,null,null,"110-7","110-7 Special Wildlife Account-Private/Local",null,null,null,null,null,null,null,null,null,null,null,null,null,null,null,null,null,null,null,null,"085","549-2","085549-2",0]
[null,"103-Department of Commerce","887-1 Public Facility Const Loan Revolv-State",{"$f":"LEFT(ActiveFunds!$C128,5)","v":"887-1"},{"$f":"IFERROR(IF(VLOOKUP(D128,#REF!,2,0)=\"O\",0,IF(VLOOKUP(D128,#REF!,2,0)=\"T\",1,0)),\"ERROR\")","v":"ERROR"},null,null,null,null,"111-1","111-1 Public Service Revolving Account-State",null,null,null,null,null,null,null,null,null,null,null,null,null,null,null,null,null,null,null,null,"086","001-1","086001-1",0]
[null,"104-Economic & Revenue Forecast Council","001-1 General Fund-State",{"$f":"LEFT(ActiveFunds!$C129,5)","v":"001-1"},{"$f":"IFERROR(IF(VLOOKUP(D129,#REF!,2,0)=\"O\",0,IF(VLOOKUP(D129,#REF!,2,0)=\"T\",1,0)),\"ERROR\")","v":"ERROR"},null,null,null,null,"116-6","116-6 Basic Data Account-Non-Appropriated",null,null,null,null,null,null,null,null,null,null,null,null,null,null,null,null,null,null,null,null,"087","001-1","087001-1",0]
[null,"104-Economic & Revenue Forecast Council","578-1 Lottery Administrative Account-State",{"$f":"LEFT(ActiveFunds!$C130,5)","v":"578-1"},{"$f":"IFERROR(IF(VLOOKUP(D130,#REF!,2,0)=\"O\",0,IF(VLOOKUP(D130,#REF!,2,0)=\"T\",1,0)),\"ERROR\")","v":"ERROR"},null,null,null,null,"119-2","119-2 Unemployment Compensation Admin-Federal",null,null,null,null,null,null,null,null,null,null,null,null,null,null,null,null,null,null,null,null,"090","404-1","090404-1",0]
[null,"105-Office of Financial Management","001-1 General Fund-State",{"$f":"LEFT(ActiveFunds!$C131,5)","v":"001-1"},{"$f":"IFERROR(IF(VLOOKUP(D131,#REF!,2,0)=\"O\",0,IF(VLOOKUP(D131,#REF!,2,0)=\"T\",1,0)),\"ERROR\")","v":"ERROR"},null,null,null,null,"11A-6","11A-6 Employment Training Finance Account-Non-Appropriated",null,null,null,null,null,null,null,null,null,null,null,null,null,null,null,null,null,null,null,null,"095","001-1","095001-1",0]
[null,"105-Office of Financial Management","001-2 General Fund-Federal",{"$f":"LEFT(ActiveFunds!$C132,5)","v":"001-2"},{"$f":"IFERROR(IF(VLOOKUP(D132,#REF!,2,0)=\"O\",0,IF(VLOOKUP(D132,#REF!,2,0)=\"T\",1,0)),\"ERROR\")","v":"ERROR"},null,null,null,null,"11B-1","11B-1 Regional Mobility Grant Pgm Account-State",null,null,null,null,null,null,null,null,null,null,null,null,null,null,null,null,null,null,null,null,"095","413-6","095413-6",0]
[null,"105-Office of Financial Management","001-7 General Fund-Private/Local",{"$f":"LEFT(ActiveFunds!$C133,5)","v":"001-7"},{"$f":"IFERROR(IF(VLOOKUP(D133,#REF!,2,0)=\"O\",0,IF(VLOOKUP(D133,#REF!,2,0)=\"T\",1,0)),\"ERROR\")","v":"ERROR"},null,null,null,null,{"$f":"MID(K133,1,5)","v":"11H-1"},"11H-1 Forest and Fish Support Account-State",null,null,null,null,null,null,null,null,null,null,null,null,null,null,null,null,null,null,null,null,"095","483-1","095483-1",0]
[null,"105-Office of Financial Management","03K-6 Industrial Insurance Premium Refund-Non-Appropriated",{"$f":"LEFT(ActiveFunds!$C134,5)","v":"03K-6"},{"$f":"IFERROR(IF(VLOOKUP(D134,#REF!,2,0)=\"O\",0,IF(VLOOKUP(D134,#REF!,2,0)=\"T\",1,0)),\"ERROR\")","v":"ERROR"},null,null,null,null,"11J-6","11J-6 Electronic Products Recycling-Non-Appropriated",null,null,null,null,null,null,null,null,null,null,null,null,null,null,null,null,null,null,null,null,"095","553-1",{"$f":"AF134&AG134","v":"095553-1"},0]
[null,"105-Office of Financial Management","081-1 State Patrol Highway Account-State",{"$f":"LEFT(ActiveFunds!$C135,5)","v":"081-1"},{"$f":"IFERROR(IF(VLOOKUP(D135,#REF!,2,0)=\"O\",0,IF(VLOOKUP(D135,#REF!,2,0)=\"T\",1,0)),\"ERROR\")","v":"ERROR"},null,null,null,null,"11K-1","11K-1 Washington Auto Theft Prevention-State",null,null,null,null,null,null,null,null,null,null,null,null,null,null,null,null,null,null,null,null,"095","553-6","095553-6",0]
[null,"105-Office of Financial Management","09R-1 Econ Dev Strategic Reserve Account-State",{"$f":"LEFT(ActiveFunds!$C136,5)","v":"09R-1"},{"$f":"IFERROR(IF(VLOOKUP(D136,#REF!,2,0)=\"O\",0,IF(VLOOKUP(D136,#REF!,2,0)=\"T\",1,0)),\"ERROR\")","v":"ERROR"},null,null,null,null,"11V-7","11V-7 Veteran Estate Management Account-Private/Local",null,null,null,null,null,null,null,null,null,null,null,null,null,null,null,null,null,null,null,null,"099","001-1","099001-1",0]
[null,"105-Office of Financial Management","108-1 Motor Vehicle Account-State",{"$f":"LEFT(ActiveFunds!$C137,5)","v":"108-1"},{"$f":"IFERROR(IF(VLOOKUP(D137,#REF!,2,0)=\"O\",0,IF(VLOOKUP(D137,#REF!,2,0)=\"T\",1,0)),\"ERROR\")","v":"ERROR"},null,null,null,null,"11V-9","11V-9 Veteran Estate Management Account-Private/Local Unanticipated",null,null,null,null,null,null,null,null,null,null,null,null,null,null,null,null,null,null,null,null,"100","001-1","100001-1",0]
[null,"105-Office of Financial Management","109-1 Puget Sound Ferry Operations Acct-State",{"$f":"LEFT(ActiveFunds!$C138,5)","v":"109-1"},{"$f":"IFERROR(IF(VLOOKUP(D138,#REF!,2,0)=\"O\",0,IF(VLOOKUP(D138,#REF!,2,0)=\"T\",1,0)),\"ERROR\")","v":"ERROR"},null,null,null,null,"120-1","120-1 Administrative Contingency Account-State",null,null,null,null,null,null,null,null,null,null,null,null,null,null,null,null,null,null,null,null,"100","001-2","100001-2",0]
[null,"105-Office of Financial Management","16R-6 Multiagency Permitting Team Account-Non-Appropriated",{"$f":"LEFT(ActiveFunds!$C139,5)","v":"16R-6"},{"$f":"IFERROR(IF(VLOOKUP(D139,#REF!,2,0)=\"O\",0,IF(VLOOKUP(D139,#REF!,2,0)=\"T\",1,0)),\"ERROR\")","v":"ERROR"},null,null,null,null,"125-1","125-1 Site Closure Account-State",null,null,null,null,null,null,null,null,null,null,null,null,null,null,null,null,null,null,null,null,"100","001-C","100001-C",0]
[null,"105-Office of Financial Management","277-6 State Agency Parking Account-Non-Appropriated",{"$f":"LEFT(ActiveFunds!$C140,5)","v":"277-6"},{"$f":"IFERROR(IF(VLOOKUP(D140,#REF!,2,0)=\"O\",0,IF(VLOOKUP(D140,#REF!,2,0)=\"T\",1,0)),\"ERROR\")","v":"ERROR"},null,null,null,null,"126-6","126-6 Agricultural Local Account-Non-Appropriated",null,null,null,null,null,null,null,null,null,null,null,null,null,null,null,null,null,null,null,null,"100","111-1","100111-1",0]
[null,"105-Office of Financial Management","415-1 Personnel Service Account-State",{"$f":"LEFT(ActiveFunds!$C141,5)","v":"415-1"},{"$f":"IFERROR(IF(VLOOKUP(D141,#REF!,2,0)=\"O\",0,IF(VLOOKUP(D141,#REF!,2,0)=\"T\",1,0)),\"ERROR\")","v":"ERROR"},null,null,null,null,"128-6","128-6 Grain Inspection Revolving Acct-Non-Appropriated",null,null,null,null,null,null,null,null,null,null,null,null,null,null,null,null,null,null,null,null,"100","12F-6","10012F-6",0]
[null,"105-Office of Financial Management","419-1 Data Processing Revolving Account-State",{"$f":"LEFT(ActiveFunds!$C142,5)","v":"419-1"},{"$f":"IFERROR(IF(VLOOKUP(D142,#REF!,2,0)=\"O\",0,IF(VLOOKUP(D142,#REF!,2,0)=\"T\",1,0)),\"ERROR\")","v":"ERROR"},null,null,null,null,"12C-1","12C-1 Affordable Housing For All-State",null,null,null,null,null,null,null,null,null,null,null,null,null,null,null,null,null,null,null,null,"100","154-1","100154-1",0]
[null,"105-Office of Financial Management","419-6 Data Processing Revolving Account-Non-Appropriated",{"$f":"LEFT(ActiveFunds!$C143,5)","v":"419-6"},{"$f":"IFERROR(IF(VLOOKUP(D143,#REF!,2,0)=\"O\",0,IF(VLOOKUP(D143,#REF!,2,0)=\"T\",1,0)),\"ERROR\")","v":"ERROR"},null,null,null,null,"12E-6","12E-6 Assisted Living Fac Temp Mgmt Acct-Non-Appropriated",null,null,null,null,null,null,null,null,null,null,null,null,null,null,null,null,null,null,null,null,"100","17L-6","10017L-6",0]
[null,"105-Office of Financial Management","421-6 Education Technology Revolving Acct-Non-Appropriated",{"$f":"LEFT(ActiveFunds!$C144,5)","v":"421-6"},{"$f":"IFERROR(IF(VLOOKUP(D144,#REF!,2,0)=\"O\",0,IF(VLOOKUP(D144,#REF!,2,0)=\"T\",1,0)),\"ERROR\")","v":"ERROR"},null,null,null,null,"12F-6","12F-6 Manufactured/Mobile Home Dispute-Non-Appropriated",null,null,null,null,null,null,null,null,null,null,null,null,null,null,null,null,null,null,null,null,"100","19A-1","10019A-1",0]
[null,"105-Office of Financial Management","436-6 OFM Labor Relations Service Acct-Non-Appropriated",{"$f":"LEFT(ActiveFunds!$C145,5)","v":"436-6"},{"$f":"IFERROR(IF(VLOOKUP(D145,#REF!,2,0)=\"O\",0,IF(VLOOKUP(D145,#REF!,2,0)=\"T\",1,0)),\"ERROR\")","v":"ERROR"},null,null,null,null,"12G-6","12G-6 Rockfish Research Account-Non-Appropriated",null,null,null,null,null,null,null,null,null,null,null,null,null,null,null,null,null,null,null,null,"100","19P-1","10019P-1",0]
[null,"105-Office of Financial Management","455-1 Higher Education Personnel Services-State",{"$f":"LEFT(ActiveFunds!$C146,5)","v":"455-1"},{"$f":"IFERROR(IF(VLOOKUP(D146,#REF!,2,0)=\"O\",0,IF(VLOOKUP(D146,#REF!,2,0)=\"T\",1,0)),\"ERROR\")","v":"ERROR"},null,null,null,null,"12H-6","12H-6 Uniformed Service Shared Leave Pool-Non-Appropriated",null,null,null,null,null,null,null,null,null,null,null,null,null,null,null,null,null,null,null,null,"100","405-1","100405-1",0]
[null,"105-Office of Financial Management","466-1 Statewide IT System Devel Rev Acct-State",{"$f":"LEFT(ActiveFunds!$C147,5)","v":"466-1"},{"$f":"IFERROR(IF(VLOOKUP(D147,#REF!,2,0)=\"O\",0,IF(VLOOKUP(D147,#REF!,2,0)=\"T\",1,0)),\"ERROR\")","v":"ERROR"},null,null,null,null,"12L-6","12L-6 Outdoor Education & Recreation Acct-Non-Appropriated",null,null,null,null,null,null,null,null,null,null,null,null,null,null,null,null,null,null,null,null,"100","424-6","100424-6",0]
[null,"105-Office of Financial Management","468-1 OFM Central Services-State",{"$f":"LEFT(ActiveFunds!$C148,5)","v":"468-1"},{"$f":"IFERROR(IF(VLOOKUP(D148,#REF!,2,0)=\"O\",0,IF(VLOOKUP(D148,#REF!,2,0)=\"T\",1,0)),\"ERROR\")","v":"ERROR"},null,null,null,null,"12M-1","12M-1 Charitable Organization Ed Acct-State",null,null,null,null,null,null,null,null,null,null,null,null,null,null,null,null,null,null,null,null,"100","828-1","100828-1",0]
[null,"105-Office of Financial Management","472-6 Statewide IT Systems M&O Rev Acct-Non-Appropriated",{"$f":"LEFT(ActiveFunds!$C149,5)","v":"472-6"},{"$f":"IFERROR(IF(VLOOKUP(D149,#REF!,2,0)=\"O\",0,IF(VLOOKUP(D149,#REF!,2,0)=\"T\",1,0)),\"ERROR\")","v":"ERROR"},null,null,null,null,"12T-1","12T-1 Traumatic Brain Injury Account-State",null,null,null,null,null,null,null,null,null,null,null,null,null,null,null,null,null,null,null,null,"101","001-1","101001-1",0]
[null,"105-Office of Financial Management","553-1 Performance Audits of Govt Acct-State",{"$f":"LEFT(ActiveFunds!$C150,5)","v":"553-1"},{"$f":"IFERROR(IF(VLOOKUP(D150,#REF!,2,0)=\"O\",0,IF(VLOOKUP(D150,#REF!,2,0)=\"T\",1,0)),\"ERROR\")","v":"ERROR"},null,null,null,null,"131-6","131-6 Fair Account-Non-Appropriated",null,null,null,null,null,null,null,null,null,null,null,null,null,null,null,null,null,null,null,null,"102","06J-6","10206J-6",0]
[null,"105-Office of Financial Management","749-6 Governor's ICSEW Account-Non-Appropriated",{"$f":"LEFT(ActiveFunds!$C151,5)","v":"749-6"},{"$f":"IFERROR(IF(VLOOKUP(D151,#REF!,2,0)=\"O\",0,IF(VLOOKUP(D151,#REF!,2,0)=\"T\",1,0)),\"ERROR\")","v":"ERROR"},null,null,null,null,"133-6","133-6 Childrens' Trust Account-Non-Appropriated",null,null,null,null,null,null,null,null,null,null,null,null,null,null,null,null,null,null,null,null,"102","07A-6","10207A-6",0]
[null,"107-WA State Health Care Authority","001-1 General Fund-State",{"$f":"LEFT(ActiveFunds!$C152,5)","v":"001-1"},{"$f":"IFERROR(IF(VLOOKUP(D152,#REF!,2,0)=\"O\",0,IF(VLOOKUP(D152,#REF!,2,0)=\"T\",1,0)),\"ERROR\")","v":"ERROR"},null,null,null,null,"134-1","134-1 Employment Services Administrative-State",null,null,null,null,null,null,null,null,null,null,null,null,null,null,null,null,null,null,null,null,"102","17L-6","10217L-6",0]
[null,"107-WA State Health Care Authority","001-2 General Fund-Federal",{"$f":"LEFT(ActiveFunds!$C153,5)","v":"001-2"},{"$f":"IFERROR(IF(VLOOKUP(D153,#REF!,2,0)=\"O\",0,IF(VLOOKUP(D153,#REF!,2,0)=\"T\",1,0)),\"ERROR\")","v":"ERROR"},null,null,null,null,"138-1","138-1 Insurance Commissioner's Regulatory-State",null,null,null,null,null,null,null,null,null,null,null,null,null,null,null,null,null,null,null,null,"102","300-6","102300-6",0]
[null,"107-WA State Health Care Authority","001-7 General Fund-Private/Local",{"$f":"LEFT(ActiveFunds!$C154,5)","v":"001-7"},{"$f":"IFERROR(IF(VLOOKUP(D154,#REF!,2,0)=\"O\",0,IF(VLOOKUP(D154,#REF!,2,0)=\"T\",1,0)),\"ERROR\")","v":"ERROR"},null,null,null,null,"141-6","141-6 Federal Seizure Account-Non-Appropriated",null,null,null,null,null,null,null,null,null,null,null,null,null,null,null,null,null,null,null,null,"103","001-1","103001-1",0]
[null,"107-WA State Health Care Authority","03C-1 Emer Med Ser/Trauma Care Sys Trust-State",{"$f":"LEFT(ActiveFunds!$C155,5)","v":"03C-1"},{"$f":"IFERROR(IF(VLOOKUP(D155,#REF!,2,0)=\"O\",0,IF(VLOOKUP(D155,#REF!,2,0)=\"T\",1,0)),\"ERROR\")","v":"ERROR"},null,null,null,null,"143-6","143-6 Inst of Hi Ed-Federal Approp Acct-Non-Appropriated",null,null,null,null,null,null,null,null,null,null,null,null,null,null,null,null,null,null,null,null,"103","001-2","103001-2",0]
[null,"107-WA State Health Care Authority","08G-6 Flexible Spending Admin Acct-Non-Appropriated",{"$f":"LEFT(ActiveFunds!$C156,5)","v":"08G-6"},{"$f":"IFERROR(IF(VLOOKUP(D156,#REF!,2,0)=\"O\",0,IF(VLOOKUP(D156,#REF!,2,0)=\"T\",1,0)),\"ERROR\")","v":"ERROR"},null,null,null,null,"144-1","144-1 Transportation Improvement Account-State",null,null,null,null,null,null,null,null,null,null,null,null,null,null,null,null,null,null,null,null,"103","001-7","103001-7",0]
[null,"107-WA State Health Care Authority","08J-6 Prescription Drug Consortium Acct-Non-Appropriated",{"$f":"LEFT(ActiveFunds!$C157,5)","v":"08J-6"},{"$f":"IFERROR(IF(VLOOKUP(D157,#REF!,2,0)=\"O\",0,IF(VLOOKUP(D157,#REF!,2,0)=\"T\",1,0)),\"ERROR\")","v":"ERROR"},null,null,null,null,"145-6","145-6 Inst of Hi Ed-Grants/Contracts Acct-Non-Appropriated",null,null,null,null,null,null,null,null,null,null,null,null,null,null,null,null,null,null,null,null,"103","001-8","103001-8",0]
[null,"107-WA State Health Care Authority","16W-1 Hospital Safety Net Assessment Acct-State",{"$f":"LEFT(ActiveFunds!$C158,5)","v":"16W-1"},{"$f":"IFERROR(IF(VLOOKUP(D158,#REF!,2,0)=\"O\",0,IF(VLOOKUP(D158,#REF!,2,0)=\"T\",1,0)),\"ERROR\")","v":"ERROR"},null,null,null,null,"145-N","145-N Inst of Hi Ed-Grants/Contracts Acct-Federal Non-Approp ARRA",null,null,null,null,null,null,null,null,null,null,null,null,null,null,null,null,null,null,null,null,"103","04R-1","10304R-1",0]
[null,"107-WA State Health Care Authority","172-6 Basic Health Plan Trust Account-Non-Appropriated",{"$f":"LEFT(ActiveFunds!$C159,5)","v":"172-6"},{"$f":"IFERROR(IF(VLOOKUP(D159,#REF!,2,0)=\"O\",0,IF(VLOOKUP(D159,#REF!,2,0)=\"T\",1,0)),\"ERROR\")","v":"ERROR"},null,null,null,null,"146-1","146-1 Firearms Range Account-State",null,null,null,null,null,null,null,null,null,null,null,null,null,null,null,null,null,null,null,null,"103","058-1","103058-1",0]
[null,"107-WA State Health Care Authority","17T-1 Health Benefit Exchange Account-State",{"$f":"LEFT(ActiveFunds!$C160,5)","v":"17T-1"},{"$f":"IFERROR(IF(VLOOKUP(D160,#REF!,2,0)=\"O\",0,IF(VLOOKUP(D160,#REF!,2,0)=\"T\",1,0)),\"ERROR\")","v":"ERROR"},null,null,null,null,"148-6","148-6 Inst of Hi Ed-Dedicated Local Acct-Non-Appropriated",null,null,null,null,null,null,null,null,null,null,null,null,null,null,null,null,null,null,null,null,"103","05R-1","10305R-1",0]
[null,"107-WA State Health Care Authority","19A-1 Medicaid Fraud Penalty Account-State",{"$f":"LEFT(ActiveFunds!$C161,5)","v":"19A-1"},{"$f":"IFERROR(IF(VLOOKUP(D161,#REF!,2,0)=\"O\",0,IF(VLOOKUP(D161,#REF!,2,0)=\"T\",1,0)),\"ERROR\")","v":"ERROR"},null,null,null,null,"149-6","149-6 Inst of Hi Ed-Operating Fees Acct-Non-Appropriated",null,null,null,null,null,null,null,null,null,null,null,null,null,null,null,null,null,null,null,null,"103","06K-1","10306K-1",0]
[null,"107-WA State Health Care Authority","315-1 Dedicated Marijuana Account-State",{"$f":"LEFT(ActiveFunds!$C162,5)","v":"315-1"},{"$f":"IFERROR(IF(VLOOKUP(D162,#REF!,2,0)=\"O\",0,IF(VLOOKUP(D162,#REF!,2,0)=\"T\",1,0)),\"ERROR\")","v":"ERROR"},null,null,null,null,"14A-1","14A-1 Wildlife Rehabilitation Account-State",null,null,null,null,null,null,null,null,null,null,null,null,null,null,null,null,null,null,null,null,"103","084-1","103084-1",0]
[null,"107-WA State Health Care Authority","418-1 St Health Care Authority Admin Acct-State",{"$f":"LEFT(ActiveFunds!$C163,5)","v":"418-1"},{"$f":"IFERROR(IF(VLOOKUP(D163,#REF!,2,0)=\"O\",0,IF(VLOOKUP(D163,#REF!,2,0)=\"T\",1,0)),\"ERROR\")","v":"ERROR"},null,null,null,null,"14B-1","14B-1 Budget Stabilization Account-State",null,null,null,null,null,null,null,null,null,null,null,null,null,null,null,null,null,null,null,null,"103","08E-6","10308E-6",0]
[null,"107-WA State Health Care Authority","438-6 Uniform Dental Plan Benefits Admin-Non-Appropriated",{"$f":"LEFT(ActiveFunds!$C164,5)","v":"438-6"},{"$f":"IFERROR(IF(VLOOKUP(D164,#REF!,2,0)=\"O\",0,IF(VLOOKUP(D164,#REF!,2,0)=\"T\",1,0)),\"ERROR\")","v":"ERROR"},null,null,null,null,"14E-1","14E-1 WA State Heritage Center Account-State",null,null,null,null,null,null,null,null,null,null,null,null,null,null,null,null,null,null,null,null,"103","09R-1","10309R-1",0]
[null,"107-WA State Health Care Authority","439-6 Uniform Medical Plan Benefits Acct-Non-Appropriated",{"$f":"LEFT(ActiveFunds!$C165,5)","v":"439-6"},{"$f":"IFERROR(IF(VLOOKUP(D165,#REF!,2,0)=\"O\",0,IF(VLOOKUP(D165,#REF!,2,0)=\"T\",1,0)),\"ERROR\")","v":"ERROR"},null,null,null,null,"14J-6","14J-6 Ambulatory Surgical Facility Acct-Non-Appropriated",null,null,null,null,null,null,null,null,null,null,null,null,null,null,null,null,null,null,null,null,"103","107-1","103107-1",0]
[null,"107-WA State Health Care Authority","447-6 Info Tech Invest Rev Acct-Non-Appropriated",{"$f":"LEFT(ActiveFunds!$C166,5)","v":"447-6"},{"$f":"IFERROR(IF(VLOOKUP(D166,#REF!,2,0)=\"O\",0,IF(VLOOKUP(D166,#REF!,2,0)=\"T\",1,0)),\"ERROR\")","v":"ERROR"},null,null,null,null,"14M-1","14M-1 Finan Frd & Id Thft Crimes Inv & Pr-State",null,null,null,null,null,null,null,null,null,null,null,null,null,null,null,null,null,null,null,null,"103","10B-1","10310B-1",0]
[null,"107-WA State Health Care Authority","492-1 School Employees' Insurance Account",{"$f":"LEFT(ActiveFunds!$C167,5)","v":"492-1"},{"$f":"IFERROR(IF(VLOOKUP(D167,#REF!,2,0)=\"O\",0,IF(VLOOKUP(D167,#REF!,2,0)=\"T\",1,0)),\"ERROR\")","v":"ERROR"},null,null,null,null,"14N-6","14N-6 Legislative Oral History Account-Non-Appropriated",null,null,null,null,null,null,null,null,null,null,null,null,null,null,null,null,null,null,null,null,"103","10R-1","10310R-1",0]
[null,"107-WA State Health Care Authority","609-1 Medical Aid Account-State",{"$f":"LEFT(ActiveFunds!$C168,5)","v":"609-1"},{"$f":"IFERROR(IF(VLOOKUP(D168,#REF!,2,0)=\"O\",0,IF(VLOOKUP(D168,#REF!,2,0)=\"T\",1,0)),\"ERROR\")","v":"ERROR"},null,null,null,null,"14P-6","14P-6 Skeletal Human Remains Assistance-Non-Appropriated",null,null,null,null,null,null,null,null,null,null,null,null,null,null,null,null,null,null,null,null,"103","12C-1","10312C-1",0]
[null,"107-WA State Health Care Authority","721-6 Public Employees/Retirees Insurance-Non-Appropriated",{"$f":"LEFT(ActiveFunds!$C169,5)","v":"721-6"},{"$f":"IFERROR(IF(VLOOKUP(D169,#REF!,2,0)=\"O\",0,IF(VLOOKUP(D169,#REF!,2,0)=\"T\",1,0)),\"ERROR\")","v":"ERROR"},null,null,null,null,"14V-1","14V-1 Ignition Interlock Device Revolving-State",null,null,null,null,null,null,null,null,null,null,null,null,null,null,null,null,null,null,null,null,"103","14M-1","10314M-1",0]
[null,"110-Office of Administrative Hearings","03K-6 Industrial Insurance Premium Refund-Non-Appropriated",{"$f":"LEFT(ActiveFunds!$C170,5)","v":"03K-6"},{"$f":"IFERROR(IF(VLOOKUP(D170,#REF!,2,0)=\"O\",0,IF(VLOOKUP(D170,#REF!,2,0)=\"T\",1,0)),\"ERROR\")","v":"ERROR"},null,null,null,null,"14W-6","14W-6 Reduced Cigarette Ignition Acct.-Non-Appropriated",null,null,null,null,null,null,null,null,null,null,null,null,null,null,null,null,null,null,null,null,"103","150-1","103150-1",0]
[null,"110-Office of Administrative Hearings","180-6 Local Gov Administrative Hearings-Non-Appropriated",{"$f":"LEFT(ActiveFunds!$C171,5)","v":"180-6"},{"$f":"IFERROR(IF(VLOOKUP(D171,#REF!,2,0)=\"O\",0,IF(VLOOKUP(D171,#REF!,2,0)=\"T\",1,0)),\"ERROR\")","v":"ERROR"},null,null,null,null,"150-1","150-1 Low-Income Weath/Struct Rehab Asst-State",null,null,null,null,null,null,null,null,null,null,null,null,null,null,null,null,null,null,null,null,"103","15A-6","10315A-6",0]
[null,"110-Office of Administrative Hearings","484-1 Administrative Hearings Revolving-State",{"$f":"LEFT(ActiveFunds!$C172,5)","v":"484-1"},{"$f":"IFERROR(IF(VLOOKUP(D172,#REF!,2,0)=\"O\",0,IF(VLOOKUP(D172,#REF!,2,0)=\"T\",1,0)),\"ERROR\")","v":"ERROR"},null,null,null,null,"153-1","153-1 Rural Mobility Grant Program Acct-State",null,null,null,null,null,null,null,null,null,null,null,null,null,null,null,null,null,null,null,null,"103","15C-7","10315C-7",0]
[null,"116-State Lottery Commission","03K-6 Industrial Insurance Premium Refund-Non-Appropriated",{"$f":"LEFT(ActiveFunds!$C173,5)","v":"03K-6"},{"$f":"IFERROR(IF(VLOOKUP(D173,#REF!,2,0)=\"O\",0,IF(VLOOKUP(D173,#REF!,2,0)=\"T\",1,0)),\"ERROR\")","v":"ERROR"},null,null,null,null,"154-1","154-1 New Motor Vehicle Arbitration Acct-State",null,null,null,null,null,null,null,null,null,null,null,null,null,null,null,null,null,null,null,null,"103","15T-6","10315T-6",0]
[null,"116-State Lottery Commission","433-6 Shared Game Lottery Acct-Non-Appropriated",{"$f":"LEFT(ActiveFunds!$C174,5)","v":"433-6"},{"$f":"IFERROR(IF(VLOOKUP(D174,#REF!,2,0)=\"O\",0,IF(VLOOKUP(D174,#REF!,2,0)=\"T\",1,0)),\"ERROR\")","v":"ERROR"},null,null,null,null,"158-1","158-1 Aquatic Land Dredged Mat Disp Site-State",null,null,null,null,null,null,null,null,null,null,null,null,null,null,null,null,null,null,null,null,"103","15T-N","10315T-N",0]
[null,"116-State Lottery Commission","577-6 State Lottery Account-Non-Appropriated",{"$f":"LEFT(ActiveFunds!$C175,5)","v":"577-6"},{"$f":"IFERROR(IF(VLOOKUP(D175,#REF!,2,0)=\"O\",0,IF(VLOOKUP(D175,#REF!,2,0)=\"T\",1,0)),\"ERROR\")","v":"ERROR"},null,null,null,null,"159-6","159-6 Parks Improvement Account-Non-Appropriated",null,null,null,null,null,null,null,null,null,null,null,null,null,null,null,null,null,null,null,null,"103","17H-6","10317H-6",0]
[null,"116-State Lottery Commission","578-1 Lottery Administrative Account-State",{"$f":"LEFT(ActiveFunds!$C176,5)","v":"578-1"},{"$f":"IFERROR(IF(VLOOKUP(D176,#REF!,2,0)=\"O\",0,IF(VLOOKUP(D176,#REF!,2,0)=\"T\",1,0)),\"ERROR\")","v":"ERROR"},null,null,null,null,"15A-6","15A-6 Transitional Housing Oper & Rent-Non-Appropriated",null,null,null,null,null,null,null,null,null,null,null,null,null,null,null,null,null,null,null,null,"103","17L-6","10317L-6",0]
[null,"117-Washington State Gambling Comm","03K-6 Industrial Insurance Premium Refund-Non-Appropriated",{"$f":"LEFT(ActiveFunds!$C177,5)","v":"03K-6"},{"$f":"IFERROR(IF(VLOOKUP(D177,#REF!,2,0)=\"O\",0,IF(VLOOKUP(D177,#REF!,2,0)=\"T\",1,0)),\"ERROR\")","v":"ERROR"},null,null,null,null,"15M-1","15M-1 Biotoxin Account-State",null,null,null,null,null,null,null,null,null,null,null,null,null,null,null,null,null,null,null,null,"103","18A-6","10318A-6",0]
[null,"117-Washington State Gambling Comm","884-6 Gambling Revolving Account-Non-Appropriated",{"$f":"LEFT(ActiveFunds!$C178,5)","v":"884-6"},{"$f":"IFERROR(IF(VLOOKUP(D178,#REF!,2,0)=\"O\",0,IF(VLOOKUP(D178,#REF!,2,0)=\"T\",1,0)),\"ERROR\")","v":"ERROR"},null,null,null,null,"15V-6","15V-6 Funeral and Cemetery Account-Non-Appropriated",null,null,null,null,null,null,null,null,null,null,null,null,null,null,null,null,null,null,null,null,"103","18P-6","10318P-6",0]
[null,"118-WA State Comm on Hispanic Affairs","001-1 General Fund-State",{"$f":"LEFT(ActiveFunds!$C179,5)","v":"001-1"},{"$f":"IFERROR(IF(VLOOKUP(D179,#REF!,2,0)=\"O\",0,IF(VLOOKUP(D179,#REF!,2,0)=\"T\",1,0)),\"ERROR\")","v":"ERROR"},null,null,null,null,"160-1","160-1 Wood Stove Education/Enforcement-State",null,null,null,null,null,null,null,null,null,null,null,null,null,null,null,null,null,null,null,null,"103","195-6","103195-6",0]
[null,"119-African-American Affairs Comm","001-1 General Fund-State",{"$f":"LEFT(ActiveFunds!$C180,5)","v":"001-1"},{"$f":"IFERROR(IF(VLOOKUP(D180,#REF!,2,0)=\"O\",0,IF(VLOOKUP(D180,#REF!,2,0)=\"T\",1,0)),\"ERROR\")","v":"ERROR"},null,null,null,null,"162-1","162-1 Farm Labor Contractor Account-State",null,null,null,null,null,null,null,null,null,null,null,null,null,null,null,null,null,null,null,null,"103","205-6","103205-6",0]
[null,"120-Human Rights Commission","001-1 General Fund-State",{"$f":"LEFT(ActiveFunds!$C181,5)","v":"001-1"},{"$f":"IFERROR(IF(VLOOKUP(D181,#REF!,2,0)=\"O\",0,IF(VLOOKUP(D181,#REF!,2,0)=\"T\",1,0)),\"ERROR\")","v":"ERROR"},null,null,null,null,"163-1","163-1 Worker/Community Right to Know Acct-State",null,null,null,null,null,null,null,null,null,null,null,null,null,null,null,null,null,null,null,null,"103","21C-6","10321C-6",0]
[null,"120-Human Rights Commission","001-2 General Fund-Federal",{"$f":"LEFT(ActiveFunds!$C182,5)","v":"001-2"},{"$f":"IFERROR(IF(VLOOKUP(D182,#REF!,2,0)=\"O\",0,IF(VLOOKUP(D182,#REF!,2,0)=\"T\",1,0)),\"ERROR\")","v":"ERROR"},null,null,null,null,"167-1","167-1 Nat Res Conserv Areas Stewardship-State",null,null,null,null,null,null,null,null,null,null,null,null,null,null,null,null,null,null,null,null,"103","237-1","103237-1",0]
[null,"124-Department of Retirement Systems","600-1 Dept of Retirement Systems Expense-State",{"$f":"LEFT(ActiveFunds!$C183,5)","v":"600-1"},{"$f":"IFERROR(IF(VLOOKUP(D183,#REF!,2,0)=\"O\",0,IF(VLOOKUP(D183,#REF!,2,0)=\"T\",1,0)),\"ERROR\")","v":"ERROR"},null,null,null,null,"169-1","169-1 Horse Racing Commission Op Account-State",null,null,null,null,null,null,null,null,null,null,null,null,null,null,null,null,null,null,null,null,"103","263-1","103263-1",0]
[null,"124-Department of Retirement Systems","600-6 Dept of Retirement Systems Expense-Non-Appropriated",{"$f":"LEFT(ActiveFunds!$C184,5)","v":"600-6"},{"$f":"IFERROR(IF(VLOOKUP(D184,#REF!,2,0)=\"O\",0,IF(VLOOKUP(D184,#REF!,2,0)=\"T\",1,0)),\"ERROR\")","v":"ERROR"},null,null,null,null,"16A-1","16A-1 Judicial Stabilization Trust Accoun-State",null,null,null,null,null,null,null,null,null,null,null,null,null,null,null,null,null,null,null,null,"103","300-1","103300-1",0]
[null,"124-Department of Retirement Systems","615-6 Washington State Patrol Retirement-Non-Appropriated",{"$f":"LEFT(ActiveFunds!$C185,5)","v":"615-6"},{"$f":"IFERROR(IF(VLOOKUP(D185,#REF!,2,0)=\"O\",0,IF(VLOOKUP(D185,#REF!,2,0)=\"T\",1,0)),\"ERROR\")","v":"ERROR"},null,null,null,null,"16B-6","16B-6 Landscape Architects' License Acct-Non-Appropriated",null,null,null,null,null,null,null,null,null,null,null,null,null,null,null,null,null,null,null,null,"103","501-1","103501-1",0]
[null,"124-Department of Retirement Systems","616-6 Judges' Retirement Account-Non-Appropriated",{"$f":"LEFT(ActiveFunds!$C186,5)","v":"616-6"},{"$f":"IFERROR(IF(VLOOKUP(D186,#REF!,2,0)=\"O\",0,IF(VLOOKUP(D186,#REF!,2,0)=\"T\",1,0)),\"ERROR\")","v":"ERROR"},null,null,null,null,"16F-6","16F-6 Washington State Flag Account-Non-Appropriated",null,null,null,null,null,null,null,null,null,null,null,null,null,null,null,null,null,null,null,null,"103","532-1","103532-1",0]
[null,"124-Department of Retirement Systems","630-6 WSP Retirement System Plan 2 Acct-Non-Appropriated",{"$f":"LEFT(ActiveFunds!$C187,5)","v":"630-6"},{"$f":"IFERROR(IF(VLOOKUP(D187,#REF!,2,0)=\"O\",0,IF(VLOOKUP(D187,#REF!,2,0)=\"T\",1,0)),\"ERROR\")","v":"ERROR"},null,null,null,null,"16G-6","16G-6 Universal Vaccine Purchase Account-Non-Appropriated",null,null,null,null,null,null,null,null,null,null,null,null,null,null,null,null,null,null,null,null,"103","746-6","103746-6",0]
[null,"124-Department of Retirement Systems","631-6 Public Employees' Retire Sys Plan I-Non-Appropriated",{"$f":"LEFT(ActiveFunds!$C188,5)","v":"631-6"},{"$f":"IFERROR(IF(VLOOKUP(D188,#REF!,2,0)=\"O\",0,IF(VLOOKUP(D188,#REF!,2,0)=\"T\",1,0)),\"ERROR\")","v":"ERROR"},null,null,null,null,"16H-6","16H-6 Col Rvr Rec Salmon/Steelhead Endrs-Non-Appropriated",null,null,null,null,null,null,null,null,null,null,null,null,null,null,null,null,null,null,null,null,"103","759-6","103759-6",0]
[null,"124-Department of Retirement Systems","632-6 Teachers' Retirement Plan I Acct-Non-Appropriated",{"$f":"LEFT(ActiveFunds!$C189,5)","v":"632-6"},{"$f":"IFERROR(IF(VLOOKUP(D189,#REF!,2,0)=\"O\",0,IF(VLOOKUP(D189,#REF!,2,0)=\"T\",1,0)),\"ERROR\")","v":"ERROR"},null,null,null,null,"16J-1","16J-1 SR 520 Corridor Account-State",null,null,null,null,null,null,null,null,null,null,null,null,null,null,null,null,null,null,null,null,"103","777-1","103777-1",0]
[null,"124-Department of Retirement Systems","633-6 School Employee Comb Plan 2 & 3-Non-Appropriated",{"$f":"LEFT(ActiveFunds!$C190,5)","v":"633-6"},{"$f":"IFERROR(IF(VLOOKUP(D190,#REF!,2,0)=\"O\",0,IF(VLOOKUP(D190,#REF!,2,0)=\"T\",1,0)),\"ERROR\")","v":"ERROR"},null,null,null,null,"16L-6","16L-6 Accessible Communities Account-Non-Appropriated",null,null,null,null,null,null,null,null,null,null,null,null,null,null,null,null,null,null,null,null,"103","887-1","103887-1",0]
[null,"124-Department of Retirement Systems","635-6 Public Employees Retirement Plan 2-Non-Appropriated",{"$f":"LEFT(ActiveFunds!$C191,5)","v":"635-6"},{"$f":"IFERROR(IF(VLOOKUP(D191,#REF!,2,0)=\"O\",0,IF(VLOOKUP(D191,#REF!,2,0)=\"T\",1,0)),\"ERROR\")","v":"ERROR"},null,null,null,null,"16M-6","16M-6 Appraisal Management Company Acct-Non-Appropriated",null,null,null,null,null,null,null,null,null,null,null,null,null,null,null,null,null,null,null,null,"104","001-1","104001-1",0]
[null,"124-Department of Retirement Systems","641-6 Public Employees' Comb Plan 2 & 3-Non-Appropriated",{"$f":"LEFT(ActiveFunds!$C192,5)","v":"641-6"},{"$f":"IFERROR(IF(VLOOKUP(D192,#REF!,2,0)=\"O\",0,IF(VLOOKUP(D192,#REF!,2,0)=\"T\",1,0)),\"ERROR\")","v":"ERROR"},null,null,null,null,"16P-1","16P-1 Marine Resources Stewardship Trust-State",null,null,null,null,null,null,null,null,null,null,null,null,null,null,null,null,null,null,null,null,"104","578-1","104578-1",0]
[null,"124-Department of Retirement Systems","642-6 Teachers' Combined Plan II & III-Non-Appropriated",{"$f":"LEFT(ActiveFunds!$C193,5)","v":"642-6"},{"$f":"IFERROR(IF(VLOOKUP(D193,#REF!,2,0)=\"O\",0,IF(VLOOKUP(D193,#REF!,2,0)=\"T\",1,0)),\"ERROR\")","v":"ERROR"},null,null,null,null,"16R-6","16R-6 Multiagency Permitting Team Account-Non-Appropriated",null,null,null,null,null,null,null,null,null,null,null,null,null,null,null,null,null,null,null,null,"105","001-1","105001-1",0]
[null,"124-Department of Retirement Systems","722-6 Deferred Compensation Principal-Non-Appropriated",{"$f":"LEFT(ActiveFunds!$C194,5)","v":"722-6"},{"$f":"IFERROR(IF(VLOOKUP(D194,#REF!,2,0)=\"O\",0,IF(VLOOKUP(D194,#REF!,2,0)=\"T\",1,0)),\"ERROR\")","v":"ERROR"},null,null,null,null,"16T-6","16T-6 Product Stewardship Programs Acct-Non-Appropriated",null,null,null,null,null,null,null,null,null,null,null,null,null,null,null,null,null,null,null,null,"105","001-2","105001-2",0]
[null,"124-Department of Retirement Systems","729-6 Judicial Retirement Principal Acct-Non-Appropriated",{"$f":"LEFT(ActiveFunds!$C195,5)","v":"729-6"},{"$f":"IFERROR(IF(VLOOKUP(D195,#REF!,2,0)=\"O\",0,IF(VLOOKUP(D195,#REF!,2,0)=\"T\",1,0)),\"ERROR\")","v":"ERROR"},null,null,null,null,"16V-1","16V-1 Water Rights Processing Account-State",null,null,null,null,null,null,null,null,null,null,null,null,null,null,null,null,null,null,null,null,"105","001-7","105001-7",0]
[null,"124-Department of Retirement Systems","819-6 LEOFF Retirement Plan I Acct-Non-Appropriated",{"$f":"LEFT(ActiveFunds!$C196,5)","v":"819-6"},{"$f":"IFERROR(IF(VLOOKUP(D196,#REF!,2,0)=\"O\",0,IF(VLOOKUP(D196,#REF!,2,0)=\"T\",1,0)),\"ERROR\")","v":"ERROR"},null,null,null,null,"16W-1","16W-1 Hospital Safety Net Assessment Acct-State",null,null,null,null,null,null,null,null,null,null,null,null,null,null,null,null,null,null,null,null,"105","09R-1","10509R-1",0]
[null,"124-Department of Retirement Systems","829-6 LEOFF Retirement Plan II Acct-Non-Appropriated",{"$f":"LEFT(ActiveFunds!$C197,5)","v":"829-6"},{"$f":"IFERROR(IF(VLOOKUP(D197,#REF!,2,0)=\"O\",0,IF(VLOOKUP(D197,#REF!,2,0)=\"T\",1,0)),\"ERROR\")","v":"ERROR"},null,null,null,null,{"$f":"MID(K197,1,5)","v":"172-6"},"172-6 Basic Health Plan Trust Account-Non-Appropriated",null,null,null,null,null,null,null,null,null,null,null,null,null,null,null,null,null,null,null,null,"105","16R-6","10516R-6",0]
[null,"124-Department of Retirement Systems","874-6 OASI Revolving Account-Non-Appropriated",{"$f":"LEFT(ActiveFunds!$C198,5)","v":"874-6"},{"$f":"IFERROR(IF(VLOOKUP(D198,#REF!,2,0)=\"O\",0,IF(VLOOKUP(D198,#REF!,2,0)=\"T\",1,0)),\"ERROR\")","v":"ERROR"},null,null,null,null,"173-1","173-1 State Toxics Control Account-State",null,null,null,null,null,null,null,null,null,null,null,null,null,null,null,null,null,null,null,null,"105","415-1",{"$f":"AF198&AG198","v":"105415-1"},0]
[null,"124-Department of Retirement Systems","882-6 Washington Judicial Retirement Acct-Non-Appropriated",{"$f":"LEFT(ActiveFunds!$C199,5)","v":"882-6"},{"$f":"IFERROR(IF(VLOOKUP(D199,#REF!,2,0)=\"O\",0,IF(VLOOKUP(D199,#REF!,2,0)=\"T\",1,0)),\"ERROR\")","v":"ERROR"},null,null,null,null,"173-7","173-7 State Toxics Control Account-Private/Local",null,null,null,null,null,null,null,null,null,null,null,null,null,null,null,null,null,null,null,null,"105","419-1","105419-1",0]
[null,"124-Department of Retirement Systems","888-6 Deferred Compensation Admin Account-Non-Appropriated",{"$f":"LEFT(ActiveFunds!$C200,5)","v":"888-6"},{"$f":"IFERROR(IF(VLOOKUP(D200,#REF!,2,0)=\"O\",0,IF(VLOOKUP(D200,#REF!,2,0)=\"T\",1,0)),\"ERROR\")","v":"ERROR"},null,null,null,null,"174-1","174-1 Local Toxics Control Account-State",null,null,null,null,null,null,null,null,null,null,null,null,null,null,null,null,null,null,null,null,"105","419-6","105419-6",0]
[null,"126-State Investment Board","031-1 State Investment Board Expense Acct-State",{"$f":"LEFT(ActiveFunds!$C201,5)","v":"031-1"},{"$f":"IFERROR(IF(VLOOKUP(D201,#REF!,2,0)=\"O\",0,IF(VLOOKUP(D201,#REF!,2,0)=\"T\",1,0)),\"ERROR\")","v":"ERROR"},null,null,null,null,"176-1","176-1 Water Quality Permit Account-State",null,null,null,null,null,null,null,null,null,null,null,null,null,null,null,null,null,null,null,null,"105","421-6","105421-6",0]
[null,"126-State Investment Board","03K-6 Industrial Insurance Premium Refund-Non-Appropriated",{"$f":"LEFT(ActiveFunds!$C202,5)","v":"03K-6"},{"$f":"IFERROR(IF(VLOOKUP(D202,#REF!,2,0)=\"O\",0,IF(VLOOKUP(D202,#REF!,2,0)=\"T\",1,0)),\"ERROR\")","v":"ERROR"},null,null,null,null,"17B-1","17B-1 Home Visiting Services Account-State",null,null,null,null,null,null,null,null,null,null,null,null,null,null,null,null,null,null,null,null,"105","436-6","105436-6",0]
[null,"140-Department of Revenue","001-1 General Fund-State",{"$f":"LEFT(ActiveFunds!$C203,5)","v":"001-1"},{"$f":"IFERROR(IF(VLOOKUP(D203,#REF!,2,0)=\"O\",0,IF(VLOOKUP(D203,#REF!,2,0)=\"T\",1,0)),\"ERROR\")","v":"ERROR"},null,null,null,null,"17B-2","17B-2 Home Visiting Services Account-Federal",null,null,null,null,null,null,null,null,null,null,null,null,null,null,null,null,null,null,null,null,"105","455-1","105455-1",0]
[null,"140-Department of Revenue","02W-1 Timber Tax Distribution Account-State",{"$f":"LEFT(ActiveFunds!$C204,5)","v":"02W-1"},{"$f":"IFERROR(IF(VLOOKUP(D204,#REF!,2,0)=\"O\",0,IF(VLOOKUP(D204,#REF!,2,0)=\"T\",1,0)),\"ERROR\")","v":"ERROR"},null,null,null,null,"17F-1","17F-1 WA Opportunity Pathways Account-State",null,null,null,null,null,null,null,null,null,null,null,null,null,null,null,null,null,null,null,null,"105","466-1","105466-1",0]
[null,"140-Department of Revenue","03N-1 Business License Account-State",{"$f":"LEFT(ActiveFunds!$C205,5)","v":"03N-1"},{"$f":"IFERROR(IF(VLOOKUP(D205,#REF!,2,0)=\"O\",0,IF(VLOOKUP(D205,#REF!,2,0)=\"T\",1,0)),\"ERROR\")","v":"ERROR"},null,null,null,null,"17L-6","17L-6 Foreclosure Fairness Account-Non-Appropriated",null,null,null,null,null,null,null,null,null,null,null,null,null,null,null,null,null,null,null,null,"105","468-1","105468-1",0]
[null,"140-Department of Revenue","044-1 Waste Reduct/Recycle/Litter Control-State",{"$f":"LEFT(ActiveFunds!$C206,5)","v":"044-1"},{"$f":"IFERROR(IF(VLOOKUP(D206,#REF!,2,0)=\"O\",0,IF(VLOOKUP(D206,#REF!,2,0)=\"T\",1,0)),\"ERROR\")","v":"ERROR"},null,null,null,null,"17M-6","17M-6 Indivi-Based/Portable Background Ch-Non-Appropriated",null,null,null,null,null,null,null,null,null,null,null,null,null,null,null,null,null,null,null,null,"105","472-6","105472-6",0]
[null,"140-Department of Revenue","173-1 State Toxics Control Account-State",{"$f":"LEFT(ActiveFunds!$C207,5)","v":"173-1"},{"$f":"IFERROR(IF(VLOOKUP(D207,#REF!,2,0)=\"O\",0,IF(VLOOKUP(D207,#REF!,2,0)=\"T\",1,0)),\"ERROR\")","v":"ERROR"},null,null,null,null,"17P-1","17P-1 SR 520 Civil Penalties Account-State",null,null,null,null,null,null,null,null,null,null,null,null,null,null,null,null,null,null,null,null,"105","553-1","105553-1",0]
[null,"140-Department of Revenue","196-6 Unclaimed Personal Property Account-Non-Appropriated",{"$f":"LEFT(ActiveFunds!$C208,5)","v":"196-6"},{"$f":"IFERROR(IF(VLOOKUP(D208,#REF!,2,0)=\"O\",0,IF(VLOOKUP(D208,#REF!,2,0)=\"T\",1,0)),\"ERROR\")","v":"ERROR"},null,null,null,null,"17R-1","17R-1 Aerospace Training Student Loan Acc-State",null,null,null,null,null,null,null,null,null,null,null,null,null,null,null,null,null,null,null,null,"107","001-1","107001-1",0]
[null,"140-Department of Revenue","300-1 Financial Services Regulation Acct-State",{"$f":"LEFT(ActiveFunds!$C209,5)","v":"300-1"},{"$f":"IFERROR(IF(VLOOKUP(D209,#REF!,2,0)=\"O\",0,IF(VLOOKUP(D209,#REF!,2,0)=\"T\",1,0)),\"ERROR\")","v":"ERROR"},null,null,null,null,"17R-6","17R-6 Aerospace Training Student Loan Acc-Non-Appropriated",null,null,null,null,null,null,null,null,null,null,null,null,null,null,null,null,null,null,null,null,"107","001-2","107001-2",0]
[null,"142-Board of Tax Appeals","001-1 General Fund-State",{"$f":"LEFT(ActiveFunds!$C210,5)","v":"001-1"},{"$f":"IFERROR(IF(VLOOKUP(D210,#REF!,2,0)=\"O\",0,IF(VLOOKUP(D210,#REF!,2,0)=\"T\",1,0)),\"ERROR\")","v":"ERROR"},null,null,null,null,"17T-1","17T-1 Health Benefit Exchange Account-State",null,null,null,null,null,null,null,null,null,null,null,null,null,null,null,null,null,null,null,null,"107","001-7","107001-7",0]
[null,"147-Minority & Women's Business Enterp","453-1 OMWBE Enterprises Account-State",{"$f":"LEFT(ActiveFunds!$C211,5)","v":"453-1"},{"$f":"IFERROR(IF(VLOOKUP(D211,#REF!,2,0)=\"O\",0,IF(VLOOKUP(D211,#REF!,2,0)=\"T\",1,0)),\"ERROR\")","v":"ERROR"},null,null,null,null,"180-6","180-6 Local Gov Administrative Hearings-Non-Appropriated",null,null,null,null,null,null,null,null,null,null,null,null,null,null,null,null,null,null,null,null,"107","001-C","107001-C",0]
[null,"160-Office of Insurance Commissioner","001-1 General Fund-State",{"$f":"LEFT(ActiveFunds!$C212,5)","v":"001-1"},{"$f":"IFERROR(IF(VLOOKUP(D212,#REF!,2,0)=\"O\",0,IF(VLOOKUP(D212,#REF!,2,0)=\"T\",1,0)),\"ERROR\")","v":"ERROR"},null,null,null,null,"182-1","182-1 Underground Storage Tank Account-State",null,null,null,null,null,null,null,null,null,null,null,null,null,null,null,null,null,null,null,null,"107","03C-1","10703C-1",0]
[null,"160-Office of Insurance Commissioner","001-2 General Fund-Federal",{"$f":"LEFT(ActiveFunds!$C213,5)","v":"001-2"},{"$f":"IFERROR(IF(VLOOKUP(D213,#REF!,2,0)=\"O\",0,IF(VLOOKUP(D213,#REF!,2,0)=\"T\",1,0)),\"ERROR\")","v":"ERROR"},null,null,null,null,"184-6","184-6 Local Museum Acct-Wa St Hist Soc-Non-Appropriated",null,null,null,null,null,null,null,null,null,null,null,null,null,null,null,null,null,null,null,null,"107","08G-6","10708G-6",0]
[null,"160-Office of Insurance Commissioner","138-1 Insurance Commissioner's Regulatory-State",{"$f":"LEFT(ActiveFunds!$C214,5)","v":"138-1"},{"$f":"IFERROR(IF(VLOOKUP(D214,#REF!,2,0)=\"O\",0,IF(VLOOKUP(D214,#REF!,2,0)=\"T\",1,0)),\"ERROR\")","v":"ERROR"},null,null,null,null,"185-6","185-6 Local Museum Acct-E Wa St Hist Soc-Non-Appropriated",null,null,null,null,null,null,null,null,null,null,null,null,null,null,null,null,null,null,null,null,"107","08J-6","10708J-6",0]
[null,"163-Consolidated Technology Services","001-1 General Fund-State",{"$f":"LEFT(ActiveFunds!$C215,5)","v":"001-1"},{"$f":"IFERROR(IF(VLOOKUP(D215,#REF!,2,0)=\"O\",0,IF(VLOOKUP(D215,#REF!,2,0)=\"T\",1,0)),\"ERROR\")","v":"ERROR"},null,null,null,null,"186-1","186-1 County Arterial Preservation Acct-State",null,null,null,null,null,null,null,null,null,null,null,null,null,null,null,null,null,null,null,null,"107","16W-1","10716W-1",0]
[null,"163-Consolidated Technology Services","03K-6 Industrial Insurance Premium Refund-Non-Appropriated",{"$f":"LEFT(ActiveFunds!$C216,5)","v":"03K-6"},{"$f":"IFERROR(IF(VLOOKUP(D216,#REF!,2,0)=\"O\",0,IF(VLOOKUP(D216,#REF!,2,0)=\"T\",1,0)),\"ERROR\")","v":"ERROR"},null,null,null,null,"18A-6","18A-6 Investing In Innovation Account-Non-Appropriated",null,null,null,null,null,null,null,null,null,null,null,null,null,null,null,null,null,null,null,null,"107","172-6","107172-6",0]
[null,"163-Consolidated Technology Services","419-6 Data Processing Revolving Account-Non-Appropriated",{"$f":"LEFT(ActiveFunds!$C217,5)","v":"419-6"},{"$f":"IFERROR(IF(VLOOKUP(D217,#REF!,2,0)=\"O\",0,IF(VLOOKUP(D217,#REF!,2,0)=\"T\",1,0)),\"ERROR\")","v":"ERROR"},null,null,null,null,"18E-6","18E-6 Educator Certification Proccessing-Non-Appropriated",null,null,null,null,null,null,null,null,null,null,null,null,null,null,null,null,null,null,null,null,"107","17T-1","10717T-1",0]
[null,"163-Consolidated Technology Services","458-1 Consolidated Tech Services Rev Acct-State",{"$f":"LEFT(ActiveFunds!$C218,5)","v":"458-1"},{"$f":"IFERROR(IF(VLOOKUP(D218,#REF!,2,0)=\"O\",0,IF(VLOOKUP(D218,#REF!,2,0)=\"T\",1,0)),\"ERROR\")","v":"ERROR"},null,null,null,null,"18G-6","18G-6 Opportunity Scholarship Match Trans-Non-Appropriated",null,null,null,null,null,null,null,null,null,null,null,null,null,null,null,null,null,null,null,null,"107","19A-1","10719A-1",0]
[null,"163-Consolidated Technology Services","458-6 Consolidated Tech Services Rev Acct-Non-Appropriated",{"$f":"LEFT(ActiveFunds!$C219,5)","v":"458-6"},{"$f":"IFERROR(IF(VLOOKUP(D219,#REF!,2,0)=\"O\",0,IF(VLOOKUP(D219,#REF!,2,0)=\"T\",1,0)),\"ERROR\")","v":"ERROR"},null,null,null,null,"18H-1","18H-1 Opportunity Expansion Account-State",null,null,null,null,null,null,null,null,null,null,null,null,null,null,null,null,null,null,null,null,"107","315-1","107315-1",0]
[null,"163-Consolidated Technology Services","458-9 Consolidated Tech Services Rev Acct-Private/Local Unanticipated",{"$f":"LEFT(ActiveFunds!$C220,5)","v":"458-9"},{"$f":"IFERROR(IF(VLOOKUP(D220,#REF!,2,0)=\"O\",0,IF(VLOOKUP(D220,#REF!,2,0)=\"T\",1,0)),\"ERROR\")","v":"ERROR"},null,null,null,null,"18K-1","18K-1 24/7 Sobriety Account-State",null,null,null,null,null,null,null,null,null,null,null,null,null,null,null,null,null,null,null,null,"107","418-1","107418-1",0]
[null,"163-Consolidated Technology Services","461-6 Shared IT Systems Revolving Acct-Non-Appropriated",{"$f":"LEFT(ActiveFunds!$C221,5)","v":"461-6"},{"$f":"IFERROR(IF(VLOOKUP(D221,#REF!,2,0)=\"O\",0,IF(VLOOKUP(D221,#REF!,2,0)=\"T\",1,0)),\"ERROR\")","v":"ERROR"},null,null,null,null,"18L-1","18L-1 Hydraulic Project Approval Account-State",null,null,null,null,null,null,null,null,null,null,null,null,null,null,null,null,null,null,null,null,"107","438-6","107438-6",0]
[null,"163-Consolidated Technology Services","472-6 Statewide IT Systems M&O Rev Acct-Non-Appropriated",{"$f":"LEFT(ActiveFunds!$C222,5)","v":"472-6"},{"$f":"IFERROR(IF(VLOOKUP(D222,#REF!,2,0)=\"O\",0,IF(VLOOKUP(D222,#REF!,2,0)=\"T\",1,0)),\"ERROR\")","v":"ERROR"},null,null,null,null,"18N-6","18N-6 Damage Prevention Account-Non-Appropriated",null,null,null,null,null,null,null,null,null,null,null,null,null,null,null,null,null,null,null,null,"107","439-6","107439-6",0]
[null,"165-State Board of Accountancy","02J-1 Certified Public Accountants' Acct-State",{"$f":"LEFT(ActiveFunds!$C223,5)","v":"02J-1"},{"$f":"IFERROR(IF(VLOOKUP(D223,#REF!,2,0)=\"O\",0,IF(VLOOKUP(D223,#REF!,2,0)=\"T\",1,0)),\"ERROR\")","v":"ERROR"},null,null,null,null,"18T-1","18T-1 Child and Family Reinvestment Acc-State",null,null,null,null,null,null,null,null,null,null,null,null,null,null,null,null,null,null,null,null,"107","609-1","107609-1",0]
[null,"167-Forensic Investigations Council","02K-1 Death Investigations Account-State",{"$f":"LEFT(ActiveFunds!$C224,5)","v":"02K-1"},{"$f":"IFERROR(IF(VLOOKUP(D224,#REF!,2,0)=\"O\",0,IF(VLOOKUP(D224,#REF!,2,0)=\"T\",1,0)),\"ERROR\")","v":"ERROR"},null,null,null,null,"190-6","190-6 Forest Fire Protection Assessment-Non-Appropriated",null,null,null,null,null,null,null,null,null,null,null,null,null,null,null,null,null,null,null,null,"110","180-6","110180-6",0]
[null,"179-Dept of Enterprise Services","001-1 General Fund-State",{"$f":"LEFT(ActiveFunds!$C225,5)","v":"001-1"},{"$f":"IFERROR(IF(VLOOKUP(D225,#REF!,2,0)=\"O\",0,IF(VLOOKUP(D225,#REF!,2,0)=\"T\",1,0)),\"ERROR\")","v":"ERROR"},null,null,null,null,"193-6","193-6 State Forest Nursery Revolving Acct-Non-Appropriated",null,null,null,null,null,null,null,null,null,null,null,null,null,null,null,null,null,null,null,null,"110","484-1","110484-1",0]
[null,"179-Dept of Enterprise Services","001-7 General Fund-Private/Local",{"$f":"LEFT(ActiveFunds!$C226,5)","v":"001-7"},{"$f":"IFERROR(IF(VLOOKUP(D226,#REF!,2,0)=\"O\",0,IF(VLOOKUP(D226,#REF!,2,0)=\"T\",1,0)),\"ERROR\")","v":"ERROR"},null,null,null,null,"196-6","196-6 Unclaimed Personal Property Account-Non-Appropriated",null,null,null,null,null,null,null,null,null,null,null,null,null,null,null,null,null,null,null,null,"116","433-6","116433-6",0]
[null,"179-Dept of Enterprise Services","045-6 State Vehicle Parking Account-Non-Appropriated",{"$f":"LEFT(ActiveFunds!$C227,5)","v":"045-6"},{"$f":"IFERROR(IF(VLOOKUP(D227,#REF!,2,0)=\"O\",0,IF(VLOOKUP(D227,#REF!,2,0)=\"T\",1,0)),\"ERROR\")","v":"ERROR"},null,null,null,null,"197-6","197-6 Statute Law Committee Publications-Non-Appropriated",null,null,null,null,null,null,null,null,null,null,null,null,null,null,null,null,null,null,null,null,"116","577-6","116577-6",0]
[null,"179-Dept of Enterprise Services","084-1 Building Code Council Account-State",{"$f":"LEFT(ActiveFunds!$C228,5)","v":"084-1"},{"$f":"IFERROR(IF(VLOOKUP(D228,#REF!,2,0)=\"O\",0,IF(VLOOKUP(D228,#REF!,2,0)=\"T\",1,0)),\"ERROR\")","v":"ERROR"},null,null,null,null,"198-6","198-6 Access Road Revolving Account-Non-Appropriated",null,null,null,null,null,null,null,null,null,null,null,null,null,null,null,null,null,null,null,null,"116","578-1","116578-1",0]
[null,"179-Dept of Enterprise Services","315-1 Dedicated Marijuana Account-State",{"$f":"LEFT(ActiveFunds!$C229,5)","v":"315-1"},{"$f":"IFERROR(IF(VLOOKUP(D229,#REF!,2,0)=\"O\",0,IF(VLOOKUP(D229,#REF!,2,0)=\"T\",1,0)),\"ERROR\")","v":"ERROR"},null,null,null,null,"199-1","199-1 Biosolids Permit Account-State",null,null,null,null,null,null,null,null,null,null,null,null,null,null,null,null,null,null,null,null,"117","141-6","117141-6",0]
[null,"179-Dept of Enterprise Services","419-6 Data Processing Revolving Account-Non-Appropriated",{"$f":"LEFT(ActiveFunds!$C230,5)","v":"419-6"},{"$f":"IFERROR(IF(VLOOKUP(D230,#REF!,2,0)=\"O\",0,IF(VLOOKUP(D230,#REF!,2,0)=\"T\",1,0)),\"ERROR\")","v":"ERROR"},null,null,null,null,"19A-1","19A-1 Medicaid Fraud Penalty Account-State",null,null,null,null,null,null,null,null,null,null,null,null,null,null,null,null,null,null,null,null,"117","226-6","117226-6",0]
[null,"179-Dept of Enterprise Services","422-6 Enterprise Services Account-Non-Appropriated",{"$f":"LEFT(ActiveFunds!$C231,5)","v":"422-6"},{"$f":"IFERROR(IF(VLOOKUP(D231,#REF!,2,0)=\"O\",0,IF(VLOOKUP(D231,#REF!,2,0)=\"T\",1,0)),\"ERROR\")","v":"ERROR"},null,null,null,null,"19B-6","19B-6 School for the Blind Account-Non-Appropriated",null,null,null,null,null,null,null,null,null,null,null,null,null,null,null,null,null,null,null,null,"117","884-6","117884-6",0]
[null,"179-Dept of Enterprise Services","546-6 Risk Management Administration Acct-Non-Appropriated",{"$f":"LEFT(ActiveFunds!$C232,5)","v":"546-6"},{"$f":"IFERROR(IF(VLOOKUP(D232,#REF!,2,0)=\"O\",0,IF(VLOOKUP(D232,#REF!,2,0)=\"T\",1,0)),\"ERROR\")","v":"ERROR"},null,null,null,null,"19C-1","19C-1 Forest Practices Application Acct-State",null,null,null,null,null,null,null,null,null,null,null,null,null,null,null,null,null,null,null,null,"118","001-1","118001-1",0]
[null,"179-Dept of Enterprise Services","547-6 Liability Account-Non-Appropriated",{"$f":"LEFT(ActiveFunds!$C233,5)","v":"547-6"},{"$f":"IFERROR(IF(VLOOKUP(D233,#REF!,2,0)=\"O\",0,IF(VLOOKUP(D233,#REF!,2,0)=\"T\",1,0)),\"ERROR\")","v":"ERROR"},null,null,null,null,"19G-1","19G-1 Environmental Legacy Stewardship-State",null,null,null,null,null,null,null,null,null,null,null,null,null,null,null,null,null,null,null,null,"119","001-1","119001-1",0]
[null,"185-Washington Horse Racing Commission","03K-6 Industrial Insurance Premium Refund-Non-Appropriated",{"$f":"LEFT(ActiveFunds!$C234,5)","v":"03K-6"},{"$f":"IFERROR(IF(VLOOKUP(D234,#REF!,2,0)=\"O\",0,IF(VLOOKUP(D234,#REF!,2,0)=\"T\",1,0)),\"ERROR\")","v":"ERROR"},null,null,null,null,"19H-6","19H-6 Center for Childhood Deafness HLA-Non-Appropriated",null,null,null,null,null,null,null,null,null,null,null,null,null,null,null,null,null,null,null,null,"120","001-1","120001-1",0]
[null,"185-Washington Horse Racing Commission","169-6 Horse Racing Commission Op Account-Non Appropriated",{"$f":"LEFT(ActiveFunds!$C235,5)","v":"169-6"},{"$f":"IFERROR(IF(VLOOKUP(D235,#REF!,2,0)=\"O\",0,IF(VLOOKUP(D235,#REF!,2,0)=\"T\",1,0)),\"ERROR\")","v":"ERROR"},null,null,null,null,"19J-6","19J-6 Universal Communications Svcs Acct-Non-Appropriated",null,null,null,null,null,null,null,null,null,null,null,null,null,null,null,null,null,null,null,null,"120","001-2","120001-2",0]
[null,"185-Washington Horse Racing Commission","485-6 Horse Racing Comm-WA Bred Owners'-Non-Appropriated",{"$f":"LEFT(ActiveFunds!$C236,5)","v":"485-6"},{"$f":"IFERROR(IF(VLOOKUP(D236,#REF!,2,0)=\"O\",0,IF(VLOOKUP(D236,#REF!,2,0)=\"T\",1,0)),\"ERROR\")","v":"ERROR"},null,null,null,null,"19L-1","19L-1 Charter School Oversight Account-State",null,null,null,null,null,null,null,null,null,null,null,null,null,null,null,null,null,null,null,null,"124","600-1","124600-1",0]
[null,"185-Washington Horse Racing Commission","497-6 Horse Racing Comm Class C Purse-Non-Appropriated",{"$f":"LEFT(ActiveFunds!$C237,5)","v":"497-6"},{"$f":"IFERROR(IF(VLOOKUP(D237,#REF!,2,0)=\"O\",0,IF(VLOOKUP(D237,#REF!,2,0)=\"T\",1,0)),\"ERROR\")","v":"ERROR"},null,null,null,null,"19P-1","19P-1 Child Rescue Fund-State",null,null,null,null,null,null,null,null,null,null,null,null,null,null,null,null,null,null,null,null,"124","600-6","124600-6",0]
[null,"190-Bd of Industrial Insurance Appeals","163-1 Worker/Community Right to Know Acct-State",{"$f":"LEFT(ActiveFunds!$C238,5)","v":"163-1"},{"$f":"IFERROR(IF(VLOOKUP(D238,#REF!,2,0)=\"O\",0,IF(VLOOKUP(D238,#REF!,2,0)=\"T\",1,0)),\"ERROR\")","v":"ERROR"},null,null,null,null,"19V-6","19V-6 Cancer Research Endow Match Transfr-Non-Appropriated",null,null,null,null,null,null,null,null,null,null,null,null,null,null,null,null,null,null,null,null,"124","844-6","124844-6",0]
[null,"190-Bd of Industrial Insurance Appeals","608-1 Accident Account-State",{"$f":"LEFT(ActiveFunds!$C239,5)","v":"608-1"},{"$f":"IFERROR(IF(VLOOKUP(D239,#REF!,2,0)=\"O\",0,IF(VLOOKUP(D239,#REF!,2,0)=\"T\",1,0)),\"ERROR\")","v":"ERROR"},null,null,null,null,"19W-6","19W-6 Wolf-Livestock Conflict Account-Non-Appropriated",null,null,null,null,null,null,null,null,null,null,null,null,null,null,null,null,null,null,null,null,"124","874-6","124874-6",0]
[null,"190-Bd of Industrial Insurance Appeals","609-1 Medical Aid Account-State",{"$f":"LEFT(ActiveFunds!$C240,5)","v":"609-1"},{"$f":"IFERROR(IF(VLOOKUP(D240,#REF!,2,0)=\"O\",0,IF(VLOOKUP(D240,#REF!,2,0)=\"T\",1,0)),\"ERROR\")","v":"ERROR"},null,null,null,null,"200-2","200-2 Regnl Fisheries Enh Salmonid Recov-Federal",null,null,null,null,null,null,null,null,null,null,null,null,null,null,null,null,null,null,null,null,"124","888-6","124888-6",0]
[null,"195-Liquor and Cannabis Board","001-1 General Fund-State",{"$f":"LEFT(ActiveFunds!$C241,5)","v":"001-1"},{"$f":"IFERROR(IF(VLOOKUP(D241,#REF!,2,0)=\"O\",0,IF(VLOOKUP(D241,#REF!,2,0)=\"T\",1,0)),\"ERROR\")","v":"ERROR"},null,null,null,null,"201-1","201-1 DOL Services Account-State",null,null,null,null,null,null,null,null,null,null,null,null,null,null,null,null,null,null,null,null,"126","031-1","126031-1",0]
[null,"195-Liquor and Cannabis Board","001-2 General Fund-Federal",{"$f":"LEFT(ActiveFunds!$C242,5)","v":"001-2"},{"$f":"IFERROR(IF(VLOOKUP(D242,#REF!,2,0)=\"O\",0,IF(VLOOKUP(D242,#REF!,2,0)=\"T\",1,0)),\"ERROR\")","v":"ERROR"},null,null,null,null,"202-1","202-1 Medical Test Site Licensure Account-State",null,null,null,null,null,null,null,null,null,null,null,null,null,null,null,null,null,null,null,null,"140","001-1","140001-1",0]
[null,"195-Liquor and Cannabis Board","001-7 General Fund-Private/Local",{"$f":"LEFT(ActiveFunds!$C243,5)","v":"001-7"},{"$f":"IFERROR(IF(VLOOKUP(D243,#REF!,2,0)=\"O\",0,IF(VLOOKUP(D243,#REF!,2,0)=\"T\",1,0)),\"ERROR\")","v":"ERROR"},null,null,null,null,"204-1","204-1 Vol Firefight/Resv Officer Admin-State",null,null,null,null,null,null,null,null,null,null,null,null,null,null,null,null,null,null,null,null,"140","02W-1","14002W-1",0]
[null,"195-Liquor and Cannabis Board","141-6 Federal Seizure Account-Non-Appropriated",{"$f":"LEFT(ActiveFunds!$C244,5)","v":"141-6"},{"$f":"IFERROR(IF(VLOOKUP(D244,#REF!,2,0)=\"O\",0,IF(VLOOKUP(D244,#REF!,2,0)=\"T\",1,0)),\"ERROR\")","v":"ERROR"},null,null,null,null,"205-6","205-6 Mobile Home Park Relocation Account-Non-Appropriated",null,null,null,null,null,null,null,null,null,null,null,null,null,null,null,null,null,null,null,null,"140","03N-1","14003N-1",0]
[null,"195-Liquor and Cannabis Board","315-1 Dedicated Marijuana Account-State",{"$f":"LEFT(ActiveFunds!$C245,5)","v":"315-1"},{"$f":"IFERROR(IF(VLOOKUP(D245,#REF!,2,0)=\"O\",0,IF(VLOOKUP(D245,#REF!,2,0)=\"T\",1,0)),\"ERROR\")","v":"ERROR"},null,null,null,null,"206-6","206-6 Cost of Supervision Account-Non-Appropriated",null,null,null,null,null,null,null,null,null,null,null,null,null,null,null,null,null,null,null,null,"140","044-1","140044-1",0]
[null,"195-Liquor and Cannabis Board","501-1 Liquor Revolving Account-State",{"$f":"LEFT(ActiveFunds!$C246,5)","v":"501-1"},{"$f":"IFERROR(IF(VLOOKUP(D246,#REF!,2,0)=\"O\",0,IF(VLOOKUP(D246,#REF!,2,0)=\"T\",1,0)),\"ERROR\")","v":"ERROR"},null,null,null,null,"207-1","207-1 Hazardous Waste Assistance Account-State",null,null,null,null,null,null,null,null,null,null,null,null,null,null,null,null,null,null,null,null,"140","173-1","140173-1",0]
[null,"205-Board of Pilotage Commissioners","025-6 Pilotage Account-Non-Appropriated",{"$f":"LEFT(ActiveFunds!$C247,5)","v":"025-6"},{"$f":"IFERROR(IF(VLOOKUP(D247,#REF!,2,0)=\"O\",0,IF(VLOOKUP(D247,#REF!,2,0)=\"T\",1,0)),\"ERROR\")","v":"ERROR"},null,null,null,null,"209-6","209-6 Regional Fisheries Enhance Group-Non-Appropriated",null,null,null,null,null,null,null,null,null,null,null,null,null,null,null,null,null,null,null,null,"140","196-6","140196-6",0]
[null,"215-Utilities and Transportation Comm","001-1 General Fund-State",{"$f":"LEFT(ActiveFunds!$C248,5)","v":"001-1"},{"$f":"IFERROR(IF(VLOOKUP(D248,#REF!,2,0)=\"O\",0,IF(VLOOKUP(D248,#REF!,2,0)=\"T\",1,0)),\"ERROR\")","v":"ERROR"},null,null,null,null,"20E-6","20E-6 WA Internet Crimes Children-Non-Appropriated",null,null,null,null,null,null,null,null,null,null,null,null,null,null,null,null,null,null,null,null,"140","300-1","140300-1",0]
[null,"215-Utilities and Transportation Comm","001-7 General Fund-Private/Local",{"$f":"LEFT(ActiveFunds!$C249,5)","v":"001-7"},{"$f":"IFERROR(IF(VLOOKUP(D249,#REF!,2,0)=\"O\",0,IF(VLOOKUP(D249,#REF!,2,0)=\"T\",1,0)),\"ERROR\")","v":"ERROR"},null,null,null,null,"20H-1","20H-1 Connecting Washington Account-State",null,null,null,null,null,null,null,null,null,null,null,null,null,null,null,null,null,null,null,null,"142","001-1","142001-1",0]
[null,"215-Utilities and Transportation Comm","03K-6 Industrial Insurance Premium Refund-Non-Appropriated",{"$f":"LEFT(ActiveFunds!$C250,5)","v":"03K-6"},{"$f":"IFERROR(IF(VLOOKUP(D250,#REF!,2,0)=\"O\",0,IF(VLOOKUP(D250,#REF!,2,0)=\"T\",1,0)),\"ERROR\")","v":"ERROR"},null,null,null,null,"20J-1","20J-1 Electric Vehicle Charging Infras-State",null,null,null,null,null,null,null,null,null,null,null,null,null,null,null,null,null,null,null,null,"147","453-1","147453-1",0]
[null,"215-Utilities and Transportation Comm","080-1 Grade Crossing Protective Account-State",{"$f":"LEFT(ActiveFunds!$C251,5)","v":"080-1"},{"$f":"IFERROR(IF(VLOOKUP(D251,#REF!,2,0)=\"O\",0,IF(VLOOKUP(D251,#REF!,2,0)=\"T\",1,0)),\"ERROR\")","v":"ERROR"},null,null,null,null,"20R-1","20R-1 Radioactive Mixed Waste Account-State",null,null,null,null,null,null,null,null,null,null,null,null,null,null,null,null,null,null,null,null,"160","001-1","160001-1",0]
[null,"215-Utilities and Transportation Comm","111-1 Public Service Revolving Account-State",{"$f":"LEFT(ActiveFunds!$C252,5)","v":"111-1"},{"$f":"IFERROR(IF(VLOOKUP(D252,#REF!,2,0)=\"O\",0,IF(VLOOKUP(D252,#REF!,2,0)=\"T\",1,0)),\"ERROR\")","v":"ERROR"},null,null,null,null,"20S-1","20S-1 Gov's Behavioral Health Innovation-State",null,null,null,null,null,null,null,null,null,null,null,null,null,null,null,null,null,null,null,null,"160","001-2","160001-2",0]
[null,"215-Utilities and Transportation Comm","18N-6 Damage Prevention Account-Non-Appropriated",{"$f":"LEFT(ActiveFunds!$C253,5)","v":"18N-6"},{"$f":"IFERROR(IF(VLOOKUP(D253,#REF!,2,0)=\"O\",0,IF(VLOOKUP(D253,#REF!,2,0)=\"T\",1,0)),\"ERROR\")","v":"ERROR"},null,null,null,null,"20T-1","20T-1 Underground Storage Tank Revolving-State",null,null,null,null,null,null,null,null,null,null,null,null,null,null,null,null,null,null,null,null,"160","138-1","160138-1",0]
[null,"215-Utilities and Transportation Comm","19J-6 Universal Communications Svcs Acct-Non-Appropriated",{"$f":"LEFT(ActiveFunds!$C254,5)","v":"19J-6"},{"$f":"IFERROR(IF(VLOOKUP(D254,#REF!,2,0)=\"O\",0,IF(VLOOKUP(D254,#REF!,2,0)=\"T\",1,0)),\"ERROR\")","v":"ERROR"},null,null,null,null,"210-6","210-6 Fire Protection Contractor License-Non-Appropriated",null,null,null,null,null,null,null,null,null,null,null,null,null,null,null,null,null,null,null,null,"163","001-1","163001-1",0]
[null,"215-Utilities and Transportation Comm","297-1 Pipeline Safety-State",{"$f":"LEFT(ActiveFunds!$C255,5)","v":"297-1"},{"$f":"IFERROR(IF(VLOOKUP(D255,#REF!,2,0)=\"O\",0,IF(VLOOKUP(D255,#REF!,2,0)=\"T\",1,0)),\"ERROR\")","v":"ERROR"},null,null,null,null,"213-6","213-6 Veterans' Emblem Account-Non-Appropriated",null,null,null,null,null,null,null,null,null,null,null,null,null,null,null,null,null,null,null,null,"163","419-6","163419-6",0]
[null,"215-Utilities and Transportation Comm","297-2 Pipeline Safety-Federal",{"$f":"LEFT(ActiveFunds!$C256,5)","v":"297-2"},{"$f":"IFERROR(IF(VLOOKUP(D256,#REF!,2,0)=\"O\",0,IF(VLOOKUP(D256,#REF!,2,0)=\"T\",1,0)),\"ERROR\")","v":"ERROR"},null,null,null,null,"214-6","214-6 Temporary Worker Housing Account-Non-Appropriated",null,null,null,null,null,null,null,null,null,null,null,null,null,null,null,null,null,null,null,null,"163","458-1","163458-1",0]
[null,"220-Board for Volunteer Firefighters","204-1 Vol Firefight/Resv Officer Admin-State",{"$f":"LEFT(ActiveFunds!$C257,5)","v":"204-1"},{"$f":"IFERROR(IF(VLOOKUP(D257,#REF!,2,0)=\"O\",0,IF(VLOOKUP(D257,#REF!,2,0)=\"T\",1,0)),\"ERROR\")","v":"ERROR"},null,null,null,null,"216-1","216-1 Air Pollution Control Account-State",null,null,null,null,null,null,null,null,null,null,null,null,null,null,null,null,null,null,null,null,"163","458-6","163458-6",0]
[null,"220-Board for Volunteer Firefighters","614-6 Vol Firefight/Rsrv Officers Princip-Non-Appropriated",{"$f":"LEFT(ActiveFunds!$C258,5)","v":"614-6"},{"$f":"IFERROR(IF(VLOOKUP(D258,#REF!,2,0)=\"O\",0,IF(VLOOKUP(D258,#REF!,2,0)=\"T\",1,0)),\"ERROR\")","v":"ERROR"},null,null,null,null,"217-1","217-1 Oil Spill Prevention Account-State",null,null,null,null,null,null,null,null,null,null,null,null,null,null,null,null,null,null,null,null,"163","461-6","163461-6",0]
[null,"225-Washington State Patrol","001-1 General Fund-State",{"$f":"LEFT(ActiveFunds!$C259,5)","v":"001-1"},{"$f":"IFERROR(IF(VLOOKUP(D259,#REF!,2,0)=\"O\",0,IF(VLOOKUP(D259,#REF!,2,0)=\"T\",1,0)),\"ERROR\")","v":"ERROR"},null,null,null,null,"218-1","218-1 Multimodal Transportation Account-State",null,null,null,null,null,null,null,null,null,null,null,null,null,null,null,null,null,null,null,null,"163","472-6","163472-6",0]
[null,"225-Washington State Patrol","001-2 General Fund-Federal",{"$f":"LEFT(ActiveFunds!$C260,5)","v":"001-2"},{"$f":"IFERROR(IF(VLOOKUP(D260,#REF!,2,0)=\"O\",0,IF(VLOOKUP(D260,#REF!,2,0)=\"T\",1,0)),\"ERROR\")","v":"ERROR"},null,null,null,null,"218-2","218-2 Multimodal Transportation Account-Federal",null,null,null,null,null,null,null,null,null,null,null,null,null,null,null,null,null,null,null,null,"165","02J-1","16502J-1",0]
[null,"225-Washington State Patrol","001-7 General Fund-Private/Local",{"$f":"LEFT(ActiveFunds!$C261,5)","v":"001-7"},{"$f":"IFERROR(IF(VLOOKUP(D261,#REF!,2,0)=\"O\",0,IF(VLOOKUP(D261,#REF!,2,0)=\"T\",1,0)),\"ERROR\")","v":"ERROR"},null,null,null,null,{"$f":"MID(K261,1,5)","v":"218-7"},"218-7 Multimodal Transportation Account-Private/Local",null,null,null,null,null,null,null,null,null,null,null,null,null,null,null,null,null,null,null,null,"167","02K-1","16702K-1",0]
[null,"225-Washington State Patrol","02K-1 Death Investigations Account-State",{"$f":"LEFT(ActiveFunds!$C262,5)","v":"02K-1"},{"$f":"IFERROR(IF(VLOOKUP(D262,#REF!,2,0)=\"O\",0,IF(VLOOKUP(D262,#REF!,2,0)=\"T\",1,0)),\"ERROR\")","v":"ERROR"},null,null,null,null,"219-1","219-1 Air Operating Permit Account-State",null,null,null,null,null,null,null,null,null,null,null,null,null,null,null,null,null,null,null,null,"179","001-1",{"$f":"AF262&AG262","v":"179001-1"},0]
[null,"225-Washington State Patrol","03F-1 Enhanced 911 Account-State",{"$f":"LEFT(ActiveFunds!$C263,5)","v":"03F-1"},{"$f":"IFERROR(IF(VLOOKUP(D263,#REF!,2,0)=\"O\",0,IF(VLOOKUP(D263,#REF!,2,0)=\"T\",1,0)),\"ERROR\")","v":"ERROR"},null,null,null,null,"21C-6","21C-6 Sexual Assault Kit Account-Non-Appropriated",null,null,null,null,null,null,null,null,null,null,null,null,null,null,null,null,null,null,null,null,"179","001-7","179001-7",0]
[null,"225-Washington State Patrol","03L-1 County Criminal Justice Assistance-State",{"$f":"LEFT(ActiveFunds!$C264,5)","v":"03L-1"},{"$f":"IFERROR(IF(VLOOKUP(D264,#REF!,2,0)=\"O\",0,IF(VLOOKUP(D264,#REF!,2,0)=\"T\",1,0)),\"ERROR\")","v":"ERROR"},null,null,null,null,"222-1","222-1 Freshwater Aquatic Weeds Account-State",null,null,null,null,null,null,null,null,null,null,null,null,null,null,null,null,null,null,null,null,"179","045-6","179045-6",0]
[null,"225-Washington State Patrol","03M-1 Municipal Criminal Justice Assist-State",{"$f":"LEFT(ActiveFunds!$C265,5)","v":"03M-1"},{"$f":"IFERROR(IF(VLOOKUP(D265,#REF!,2,0)=\"O\",0,IF(VLOOKUP(D265,#REF!,2,0)=\"T\",1,0)),\"ERROR\")","v":"ERROR"},null,null,null,null,"223-1","223-1 Oil Spill Response Account-State",null,null,null,null,null,null,null,null,null,null,null,null,null,null,null,null,null,null,null,null,"179","084-1","179084-1",0]
[null,"225-Washington State Patrol","03P-1 Fire Service Trust Account-State",{"$f":"LEFT(ActiveFunds!$C266,5)","v":"03P-1"},{"$f":"IFERROR(IF(VLOOKUP(D266,#REF!,2,0)=\"O\",0,IF(VLOOKUP(D266,#REF!,2,0)=\"T\",1,0)),\"ERROR\")","v":"ERROR"},null,null,null,null,"225-1","225-1 Fingerprint Identification Account-State",null,null,null,null,null,null,null,null,null,null,null,null,null,null,null,null,null,null,null,null,"179","315-1","179315-1",0]
[null,"225-Washington State Patrol","04V-1 Vehicle License Fraud Account-State",{"$f":"LEFT(ActiveFunds!$C267,5)","v":"04V-1"},{"$f":"IFERROR(IF(VLOOKUP(D267,#REF!,2,0)=\"O\",0,IF(VLOOKUP(D267,#REF!,2,0)=\"T\",1,0)),\"ERROR\")","v":"ERROR"},null,null,null,null,"226-6","226-6 State Seizure Account-Non-Appropriated",null,null,null,null,null,null,null,null,null,null,null,null,null,null,null,null,null,null,null,null,"179","419-6","179419-6",0]
[null,"225-Washington State Patrol","05H-1 Disaster Response Account-State",{"$f":"LEFT(ActiveFunds!$C268,5)","v":"05H-1"},{"$f":"IFERROR(IF(VLOOKUP(D268,#REF!,2,0)=\"O\",0,IF(VLOOKUP(D268,#REF!,2,0)=\"T\",1,0)),\"ERROR\")","v":"ERROR"},null,null,null,null,"234-1","234-1 Public Works Administration Acct-State",null,null,null,null,null,null,null,null,null,null,null,null,null,null,null,null,null,null,null,null,"179","422-6","179422-6",0]
[null,"225-Washington State Patrol","081-1 State Patrol Highway Account-State",{"$f":"LEFT(ActiveFunds!$C269,5)","v":"081-1"},{"$f":"IFERROR(IF(VLOOKUP(D269,#REF!,2,0)=\"O\",0,IF(VLOOKUP(D269,#REF!,2,0)=\"T\",1,0)),\"ERROR\")","v":"ERROR"},null,null,null,null,"235-1","235-1 Youth Tobacco/Vapor Prod Prev Acct-State",null,null,null,null,null,null,null,null,null,null,null,null,null,null,null,null,null,null,null,null,"179","546-6","179546-6",0]
[null,"225-Washington State Patrol","081-2 State Patrol Highway Account-Federal",{"$f":"LEFT(ActiveFunds!$C270,5)","v":"081-2"},{"$f":"IFERROR(IF(VLOOKUP(D270,#REF!,2,0)=\"O\",0,IF(VLOOKUP(D270,#REF!,2,0)=\"T\",1,0)),\"ERROR\")","v":"ERROR"},null,null,null,null,"237-1","237-1 Recreation Access Pass Account-State",null,null,null,null,null,null,null,null,null,null,null,null,null,null,null,null,null,null,null,null,"185","169-1","185169-1",0]
[null,"225-Washington State Patrol","081-7 State Patrol Highway Account-Private/Local",{"$f":"LEFT(ActiveFunds!$C271,5)","v":"081-7"},{"$f":"IFERROR(IF(VLOOKUP(D271,#REF!,2,0)=\"O\",0,IF(VLOOKUP(D271,#REF!,2,0)=\"T\",1,0)),\"ERROR\")","v":"ERROR"},null,null,null,null,"252-6","252-6 Hi Ed Non-Proprietary Local Capital-Non-Appropriated",null,null,null,null,null,null,null,null,null,null,null,null,null,null,null,null,null,null,null,null,"185","169-6","185169-6",0]
[null,"225-Washington State Patrol","086-1 Fire Service Training Account-State",{"$f":"LEFT(ActiveFunds!$C272,5)","v":"086-1"},{"$f":"IFERROR(IF(VLOOKUP(D272,#REF!,2,0)=\"O\",0,IF(VLOOKUP(D272,#REF!,2,0)=\"T\",1,0)),\"ERROR\")","v":"ERROR"},null,null,null,null,"253-1","253-1 Education Construction Account-State",null,null,null,null,null,null,null,null,null,null,null,null,null,null,null,null,null,null,null,null,"185","485-6","185485-6",0]
[null,"225-Washington State Patrol","09M-1 Aquatic Invasive Species Enf. Acct.-State",{"$f":"LEFT(ActiveFunds!$C273,5)","v":"09M-1"},{"$f":"IFERROR(IF(VLOOKUP(D273,#REF!,2,0)=\"O\",0,IF(VLOOKUP(D273,#REF!,2,0)=\"T\",1,0)),\"ERROR\")","v":"ERROR"},null,null,null,null,"259-6","259-6 Coastal Crab Account-Non-Appropriated",null,null,null,null,null,null,null,null,null,null,null,null,null,null,null,null,null,null,null,null,"185","497-6","185497-6",0]
[null,"225-Washington State Patrol","106-1 Highway Safety Account-State",{"$f":"LEFT(ActiveFunds!$C274,5)","v":"106-1"},{"$f":"IFERROR(IF(VLOOKUP(D274,#REF!,2,0)=\"O\",0,IF(VLOOKUP(D274,#REF!,2,0)=\"T\",1,0)),\"ERROR\")","v":"ERROR"},null,null,null,null,"262-1","262-1 Manufacture Home Install/Training-State",null,null,null,null,null,null,null,null,null,null,null,null,null,null,null,null,null,null,null,null,"190","163-1","190163-1",0]
[null,"225-Washington State Patrol","141-6 Federal Seizure Account-Non-Appropriated",{"$f":"LEFT(ActiveFunds!$C275,5)","v":"141-6"},{"$f":"IFERROR(IF(VLOOKUP(D275,#REF!,2,0)=\"O\",0,IF(VLOOKUP(D275,#REF!,2,0)=\"T\",1,0)),\"ERROR\")","v":"ERROR"},null,null,null,null,"263-1","263-1 Community/Economic Development Fee-State",null,null,null,null,null,null,null,null,null,null,null,null,null,null,null,null,null,null,null,null,"190","608-1","190608-1",0]
[null,"225-Washington State Patrol","14B-1 Budget Stabilization Account-State",{"$f":"LEFT(ActiveFunds!$C276,5)","v":"14B-1"},{"$f":"IFERROR(IF(VLOOKUP(D276,#REF!,2,0)=\"O\",0,IF(VLOOKUP(D276,#REF!,2,0)=\"T\",1,0)),\"ERROR\")","v":"ERROR"},null,null,null,null,"267-1","267-1 Recreation Resources Account-State",null,null,null,null,null,null,null,null,null,null,null,null,null,null,null,null,null,null,null,null,"190","609-1","190609-1",0]
[null,"225-Washington State Patrol","14W-6 Reduced Cigarette Ignition Acct.-Non-Appropriated",{"$f":"LEFT(ActiveFunds!$C277,5)","v":"14W-6"},{"$f":"IFERROR(IF(VLOOKUP(D277,#REF!,2,0)=\"O\",0,IF(VLOOKUP(D277,#REF!,2,0)=\"T\",1,0)),\"ERROR\")","v":"ERROR"},null,null,null,null,"268-1","268-1 NOVA Program Account-State",null,null,null,null,null,null,null,null,null,null,null,null,null,null,null,null,null,null,null,null,"195","001-1","195001-1",0]
[null,"225-Washington State Patrol","173-1 State Toxics Control Account-State",{"$f":"LEFT(ActiveFunds!$C278,5)","v":"173-1"},{"$f":"IFERROR(IF(VLOOKUP(D278,#REF!,2,0)=\"O\",0,IF(VLOOKUP(D278,#REF!,2,0)=\"T\",1,0)),\"ERROR\")","v":"ERROR"},null,null,null,null,"269-1","269-1 Parks Renewal & Stewardship Acct-State",null,null,null,null,null,null,null,null,null,null,null,null,null,null,null,null,null,null,null,null,"195","001-2","195001-2",0]
[null,"225-Washington State Patrol","210-6 Fire Protection Contractor License-Non-Appropriated",{"$f":"LEFT(ActiveFunds!$C279,5)","v":"210-6"},{"$f":"IFERROR(IF(VLOOKUP(D279,#REF!,2,0)=\"O\",0,IF(VLOOKUP(D279,#REF!,2,0)=\"T\",1,0)),\"ERROR\")","v":"ERROR"},null,null,null,null,"269-7","269-7 Parks Renewal & Stewardship Acct-Private/Local",null,null,null,null,null,null,null,null,null,null,null,null,null,null,null,null,null,null,null,null,"195","001-7","195001-7",0]
[null,"225-Washington State Patrol","218-1 Multimodal Transportation Account-State",{"$f":"LEFT(ActiveFunds!$C280,5)","v":"218-1"},{"$f":"IFERROR(IF(VLOOKUP(D280,#REF!,2,0)=\"O\",0,IF(VLOOKUP(D280,#REF!,2,0)=\"T\",1,0)),\"ERROR\")","v":"ERROR"},null,null,null,null,"274-6","274-6 Adult Family Home Account-Non-Appropriated",null,null,null,null,null,null,null,null,null,null,null,null,null,null,null,null,null,null,null,null,"195","141-6","195141-6",0]
[null,"225-Washington State Patrol","21C-6 Sexual Assault Kit Account-Non-Appropriated",{"$f":"LEFT(ActiveFunds!$C281,5)","v":"21C-6"},{"$f":"IFERROR(IF(VLOOKUP(D281,#REF!,2,0)=\"O\",0,IF(VLOOKUP(D281,#REF!,2,0)=\"T\",1,0)),\"ERROR\")","v":"ERROR"},null,null,null,null,"277-6","277-6 State Agency Parking Account-Non-Appropriated",null,null,null,null,null,null,null,null,null,null,null,null,null,null,null,null,null,null,null,null,"195","315-1","195315-1",0]
[null,"225-Washington State Patrol","225-1 Fingerprint Identification Account-State",{"$f":"LEFT(ActiveFunds!$C282,5)","v":"225-1"},{"$f":"IFERROR(IF(VLOOKUP(D282,#REF!,2,0)=\"O\",0,IF(VLOOKUP(D282,#REF!,2,0)=\"T\",1,0)),\"ERROR\")","v":"ERROR"},null,null,null,null,"283-2","283-2 Juvenile Acctbl Incentive Acct-Federal",null,null,null,null,null,null,null,null,null,null,null,null,null,null,null,null,null,null,null,null,"195","501-1","195501-1",0]
[null,"225-Washington State Patrol","226-6 State Seizure Account-Non-Appropriated",{"$f":"LEFT(ActiveFunds!$C283,5)","v":"226-6"},{"$f":"IFERROR(IF(VLOOKUP(D283,#REF!,2,0)=\"O\",0,IF(VLOOKUP(D283,#REF!,2,0)=\"T\",1,0)),\"ERROR\")","v":"ERROR"},null,null,null,null,"297-1","297-1 Pipeline Safety-State",null,null,null,null,null,null,null,null,null,null,null,null,null,null,null,null,null,null,null,null,"215","001-1","215001-1",0]
[null,"225-Washington State Patrol","447-6 Info Tech Invest Rev Acct-Non-Appropriated",{"$f":"LEFT(ActiveFunds!$C284,5)","v":"447-6"},{"$f":"IFERROR(IF(VLOOKUP(D284,#REF!,2,0)=\"O\",0,IF(VLOOKUP(D284,#REF!,2,0)=\"T\",1,0)),\"ERROR\")","v":"ERROR"},null,null,null,null,"297-2","297-2 Pipeline Safety-Federal",null,null,null,null,null,null,null,null,null,null,null,null,null,null,null,null,null,null,null,null,"215","001-7","215001-7",0]
[null,"225-Washington State Patrol","471-6 State Patrol N Air Rev Account-Non-Appropriated",{"$f":"LEFT(ActiveFunds!$C285,5)","v":"471-6"},{"$f":"IFERROR(IF(VLOOKUP(D285,#REF!,2,0)=\"O\",0,IF(VLOOKUP(D285,#REF!,2,0)=\"T\",1,0)),\"ERROR\")","v":"ERROR"},null,null,null,null,"298-1","298-1 Geologists' Account-State",null,null,null,null,null,null,null,null,null,null,null,null,null,null,null,null,null,null,null,null,"215","111-1","215111-1",0]
[null,"225-Washington State Patrol","515-6 DNA Data Base Account-Non-Appropriated",{"$f":"LEFT(ActiveFunds!$C286,5)","v":"515-6"},{"$f":"IFERROR(IF(VLOOKUP(D286,#REF!,2,0)=\"O\",0,IF(VLOOKUP(D286,#REF!,2,0)=\"T\",1,0)),\"ERROR\")","v":"ERROR"},null,null,null,null,"298-6","298-6 Geologists' Account-Non-Appropriated",null,null,null,null,null,null,null,null,null,null,null,null,null,null,null,null,null,null,null,null,"215","19J-6","21519J-6",0]
[null,"227-Criminal Justice Training Comm","001-1 General Fund-State",{"$f":"LEFT(ActiveFunds!$C287,5)","v":"001-1"},{"$f":"IFERROR(IF(VLOOKUP(D287,#REF!,2,0)=\"O\",0,IF(VLOOKUP(D287,#REF!,2,0)=\"T\",1,0)),\"ERROR\")","v":"ERROR"},null,null,null,null,"300-1","300-1 Financial Services Regulation Acct-State",null,null,null,null,null,null,null,null,null,null,null,null,null,null,null,null,null,null,null,null,"215","297-1","215297-1",0]
[null,"227-Criminal Justice Training Comm","001-7 General Fund-Private/Local",{"$f":"LEFT(ActiveFunds!$C288,5)","v":"001-7"},{"$f":"IFERROR(IF(VLOOKUP(D288,#REF!,2,0)=\"O\",0,IF(VLOOKUP(D288,#REF!,2,0)=\"T\",1,0)),\"ERROR\")","v":"ERROR"},null,null,null,null,"300-6","300-6 Financial Services Regulation Acct-Non-Appropriated",null,null,null,null,null,null,null,null,null,null,null,null,null,null,null,null,null,null,null,null,"215","297-2","215297-2",0]
[null,"227-Criminal Justice Training Comm","001-9 General Fund-Private/Local Unanticipated",{"$f":"LEFT(ActiveFunds!$C289,5)","v":"001-9"},{"$f":"IFERROR(IF(VLOOKUP(D289,#REF!,2,0)=\"O\",0,IF(VLOOKUP(D289,#REF!,2,0)=\"T\",1,0)),\"ERROR\")","v":"ERROR"},null,null,null,null,"315-1","315-1 Dedicated Marijuana Account-State",null,null,null,null,null,null,null,null,null,null,null,null,null,null,null,null,null,null,null,null,"220","204-1","220204-1",0]
[null,"227-Criminal Justice Training Comm","02K-1 Death Investigations Account-State",{"$f":"LEFT(ActiveFunds!$C290,5)","v":"02K-1"},{"$f":"IFERROR(IF(VLOOKUP(D290,#REF!,2,0)=\"O\",0,IF(VLOOKUP(D290,#REF!,2,0)=\"T\",1,0)),\"ERROR\")","v":"ERROR"},null,null,null,null,"319-7","319-7 Public Health Supplemental Acct-Private/Local",null,null,null,null,null,null,null,null,null,null,null,null,null,null,null,null,null,null,null,null,"225","001-1","225001-1",0]
[null,"227-Criminal Justice Training Comm","03M-1 Municipal Criminal Justice Assist-State",{"$f":"LEFT(ActiveFunds!$C291,5)","v":"03M-1"},{"$f":"IFERROR(IF(VLOOKUP(D291,#REF!,2,0)=\"O\",0,IF(VLOOKUP(D291,#REF!,2,0)=\"T\",1,0)),\"ERROR\")","v":"ERROR"},null,null,null,null,"320-6","320-6 Puget Sound Crab Pot Buoy Tag Acct-Non-Appropriated",null,null,null,null,null,null,null,null,null,null,null,null,null,null,null,null,null,null,null,null,"225","001-2","225001-2",0]
[null,"227-Criminal Justice Training Comm","11K-1 Washington Auto Theft Prevention-State",{"$f":"LEFT(ActiveFunds!$C292,5)","v":"11K-1"},{"$f":"IFERROR(IF(VLOOKUP(D292,#REF!,2,0)=\"O\",0,IF(VLOOKUP(D292,#REF!,2,0)=\"T\",1,0)),\"ERROR\")","v":"ERROR"},null,null,null,null,"347-6","347-6 WSU Bond Retirement Account-Non-Appropriated",null,null,null,null,null,null,null,null,null,null,null,null,null,null,null,null,null,null,null,null,"225","001-7","225001-7",0]
[null,"227-Criminal Justice Training Comm","18K-1 24/7 Sobriety Account-State",{"$f":"LEFT(ActiveFunds!$C293,5)","v":"18K-1"},{"$f":"IFERROR(IF(VLOOKUP(D293,#REF!,2,0)=\"O\",0,IF(VLOOKUP(D293,#REF!,2,0)=\"T\",1,0)),\"ERROR\")","v":"ERROR"},null,null,null,null,"401-6","401-6 Correctional Industries Account-Non-Appropriated",null,null,null,null,null,null,null,null,null,null,null,null,null,null,null,null,null,null,null,null,"225","02K-1","22502K-1",0]
[null,"227-Criminal Justice Training Comm","20E-6 WA Internet Crimes Children-Non-Appropriated",{"$f":"LEFT(ActiveFunds!$C294,5)","v":"20E-6"},{"$f":"IFERROR(IF(VLOOKUP(D294,#REF!,2,0)=\"O\",0,IF(VLOOKUP(D294,#REF!,2,0)=\"T\",1,0)),\"ERROR\")","v":"ERROR"},null,null,null,null,"403-6","403-6 Self-Insurance Revolving Account-Non-Appropriated",null,null,null,null,null,null,null,null,null,null,null,null,null,null,null,null,null,null,null,null,"225","03F-1","22503F-1",0]
[null,"228-WA Traffic Safety Commission","106-1 Highway Safety Account-State",{"$f":"LEFT(ActiveFunds!$C295,5)","v":"106-1"},{"$f":"IFERROR(IF(VLOOKUP(D295,#REF!,2,0)=\"O\",0,IF(VLOOKUP(D295,#REF!,2,0)=\"T\",1,0)),\"ERROR\")","v":"ERROR"},null,null,null,null,"404-1","404-1 State Treasurer's Service Account-State",null,null,null,null,null,null,null,null,null,null,null,null,null,null,null,null,null,null,null,null,"225","03L-1","22503L-1",0]
[null,"228-WA Traffic Safety Commission","106-2 Highway Safety Account-Federal",{"$f":"LEFT(ActiveFunds!$C296,5)","v":"106-2"},{"$f":"IFERROR(IF(VLOOKUP(D296,#REF!,2,0)=\"O\",0,IF(VLOOKUP(D296,#REF!,2,0)=\"T\",1,0)),\"ERROR\")","v":"ERROR"},null,null,null,null,"405-1","405-1 Legal Services Revolving Account-State",null,null,null,null,null,null,null,null,null,null,null,null,null,null,null,null,null,null,null,null,"225","03M-1","22503M-1",0]
[null,"228-WA Traffic Safety Commission","106-7 Highway Safety Account-Private/Local",{"$f":"LEFT(ActiveFunds!$C297,5)","v":"106-7"},{"$f":"IFERROR(IF(VLOOKUP(D297,#REF!,2,0)=\"O\",0,IF(VLOOKUP(D297,#REF!,2,0)=\"T\",1,0)),\"ERROR\")","v":"ERROR"},null,null,null,null,"407-6","407-6 Secretary of State's Revolving Acct-Non-Appropriated",null,null,null,null,null,null,null,null,null,null,null,null,null,null,null,null,null,null,null,null,"225","03P-1","22503P-1",0]
[null,"228-WA Traffic Safety Commission","106-9 Highway Safety Account-Private/Local Unanticipated",{"$f":"LEFT(ActiveFunds!$C298,5)","v":"106-9"},{"$f":"IFERROR(IF(VLOOKUP(D298,#REF!,2,0)=\"O\",0,IF(VLOOKUP(D298,#REF!,2,0)=\"T\",1,0)),\"ERROR\")","v":"ERROR"},null,null,null,null,"408-6","408-6 Coastal Protection Account-Non-Appropriated",null,null,null,null,null,null,null,null,null,null,null,null,null,null,null,null,null,null,null,null,"225","04V-1","22504V-1",0]
[null,"228-WA Traffic Safety Commission","780-1 School Zone Safety Account-State",{"$f":"LEFT(ActiveFunds!$C299,5)","v":"780-1"},{"$f":"IFERROR(IF(VLOOKUP(D299,#REF!,2,0)=\"O\",0,IF(VLOOKUP(D299,#REF!,2,0)=\"T\",1,0)),\"ERROR\")","v":"ERROR"},null,null,null,null,"410-6","410-6 Transportation Equipment Account-Non-Appropriated",null,null,null,null,null,null,null,null,null,null,null,null,null,null,null,null,null,null,null,null,"225","05H-1","22505H-1",0]
[null,"235-Department of Labor and Industries","001-1 General Fund-State",{"$f":"LEFT(ActiveFunds!$C300,5)","v":"001-1"},{"$f":"IFERROR(IF(VLOOKUP(D300,#REF!,2,0)=\"O\",0,IF(VLOOKUP(D300,#REF!,2,0)=\"T\",1,0)),\"ERROR\")","v":"ERROR"},null,null,null,null,"411-6","411-6 Natural Resources Equipment Account-Non-Appropriated",null,null,null,null,null,null,null,null,null,null,null,null,null,null,null,null,null,null,null,null,"225","086-1","225086-1",0]
[null,"235-Department of Labor and Industries","001-2 General Fund-Federal",{"$f":"LEFT(ActiveFunds!$C301,5)","v":"001-2"},{"$f":"IFERROR(IF(VLOOKUP(D301,#REF!,2,0)=\"O\",0,IF(VLOOKUP(D301,#REF!,2,0)=\"T\",1,0)),\"ERROR\")","v":"ERROR"},null,null,null,null,"413-6","413-6 Municipal Revolving Account-Non-Appropriated",null,null,null,null,null,null,null,null,null,null,null,null,null,null,null,null,null,null,null,null,"225","09M-1","22509M-1",0]
[null,"235-Department of Labor and Industries","01F-6 Crime Victims Compensation Account-Non-Appropriated",{"$f":"LEFT(ActiveFunds!$C302,5)","v":"01F-6"},{"$f":"IFERROR(IF(VLOOKUP(D302,#REF!,2,0)=\"O\",0,IF(VLOOKUP(D302,#REF!,2,0)=\"T\",1,0)),\"ERROR\")","v":"ERROR"},null,null,null,null,"415-1","415-1 Personnel Service Account-State",null,null,null,null,null,null,null,null,null,null,null,null,null,null,null,null,null,null,null,null,"225","141-6","225141-6",0]
[null,"235-Department of Labor and Industries","03B-1 Asbestos Account-State",{"$f":"LEFT(ActiveFunds!$C303,5)","v":"03B-1"},{"$f":"IFERROR(IF(VLOOKUP(D303,#REF!,2,0)=\"O\",0,IF(VLOOKUP(D303,#REF!,2,0)=\"T\",1,0)),\"ERROR\")","v":"ERROR"},null,null,null,null,"416-6","416-6 Surplus/Donated Food Commod Revolv-Non-Appropriated",null,null,null,null,null,null,null,null,null,null,null,null,null,null,null,null,null,null,null,null,"225","14B-1","22514B-1",0]
[null,"235-Department of Labor and Industries","03K-6 Industrial Insurance Premium Refund-Non-Appropriated",{"$f":"LEFT(ActiveFunds!$C304,5)","v":"03K-6"},{"$f":"IFERROR(IF(VLOOKUP(D304,#REF!,2,0)=\"O\",0,IF(VLOOKUP(D304,#REF!,2,0)=\"T\",1,0)),\"ERROR\")","v":"ERROR"},null,null,null,null,"418-1","418-1 St Health Care Authority Admin Acct-State",null,null,null,null,null,null,null,null,null,null,null,null,null,null,null,null,null,null,null,null,"225","14W-6","22514W-6",0]
[null,"235-Department of Labor and Industries","095-1 Electrical License Account-State",{"$f":"LEFT(ActiveFunds!$C305,5)","v":"095-1"},{"$f":"IFERROR(IF(VLOOKUP(D305,#REF!,2,0)=\"O\",0,IF(VLOOKUP(D305,#REF!,2,0)=\"T\",1,0)),\"ERROR\")","v":"ERROR"},null,null,null,null,"419-1","419-1 Data Processing Revolving Account-State",null,null,null,null,null,null,null,null,null,null,null,null,null,null,null,null,null,null,null,null,"225","173-1","225173-1",0]
[null,"235-Department of Labor and Industries","162-1 Farm Labor Contractor Account-State",{"$f":"LEFT(ActiveFunds!$C306,5)","v":"162-1"},{"$f":"IFERROR(IF(VLOOKUP(D306,#REF!,2,0)=\"O\",0,IF(VLOOKUP(D306,#REF!,2,0)=\"T\",1,0)),\"ERROR\")","v":"ERROR"},null,null,null,null,"419-6","419-6 Data Processing Revolving Account-Non-Appropriated",null,null,null,null,null,null,null,null,null,null,null,null,null,null,null,null,null,null,null,null,"225","210-6","225210-6",0]
[null,"235-Department of Labor and Industries","163-1 Worker/Community Right to Know Acct-State",{"$f":"LEFT(ActiveFunds!$C307,5)","v":"163-1"},{"$f":"IFERROR(IF(VLOOKUP(D307,#REF!,2,0)=\"O\",0,IF(VLOOKUP(D307,#REF!,2,0)=\"T\",1,0)),\"ERROR\")","v":"ERROR"},null,null,null,null,"421-6","421-6 Education Technology Revolving Acct-Non-Appropriated",null,null,null,null,null,null,null,null,null,null,null,null,null,null,null,null,null,null,null,null,"225","21C-6","22521C-6",0]
[null,"235-Department of Labor and Industries","234-1 Public Works Administration Acct-State",{"$f":"LEFT(ActiveFunds!$C308,5)","v":"234-1"},{"$f":"IFERROR(IF(VLOOKUP(D308,#REF!,2,0)=\"O\",0,IF(VLOOKUP(D308,#REF!,2,0)=\"T\",1,0)),\"ERROR\")","v":"ERROR"},null,null,null,null,"422-6","422-6 Enterprise Services Account-Non-Appropriated",null,null,null,null,null,null,null,null,null,null,null,null,null,null,null,null,null,null,null,null,"225","225-1","225225-1",0]
[null,"235-Department of Labor and Industries","262-1 Manufacture Home Install/Training-State",{"$f":"LEFT(ActiveFunds!$C309,5)","v":"262-1"},{"$f":"IFERROR(IF(VLOOKUP(D309,#REF!,2,0)=\"O\",0,IF(VLOOKUP(D309,#REF!,2,0)=\"T\",1,0)),\"ERROR\")","v":"ERROR"},null,null,null,null,"424-6","424-6 Anti-Trust Revolving Account-Non-Appropriated",null,null,null,null,null,null,null,null,null,null,null,null,null,null,null,null,null,null,null,null,"225","226-6","225226-6",0]
[null,"235-Department of Labor and Industries","445-6 Self Insur Emp Overpay Reim Acct-Non-Appropriated",{"$f":"LEFT(ActiveFunds!$C310,5)","v":"445-6"},{"$f":"IFERROR(IF(VLOOKUP(D310,#REF!,2,0)=\"O\",0,IF(VLOOKUP(D310,#REF!,2,0)=\"T\",1,0)),\"ERROR\")","v":"ERROR"},null,null,null,null,"433-6","433-6 Shared Game Lottery Acct-Non-Appropriated",null,null,null,null,null,null,null,null,null,null,null,null,null,null,null,null,null,null,null,null,"225","447-6","225447-6",0]
[null,"235-Department of Labor and Industries","608-1 Accident Account-State",{"$f":"LEFT(ActiveFunds!$C311,5)","v":"608-1"},{"$f":"IFERROR(IF(VLOOKUP(D311,#REF!,2,0)=\"O\",0,IF(VLOOKUP(D311,#REF!,2,0)=\"T\",1,0)),\"ERROR\")","v":"ERROR"},null,null,null,null,"436-6","436-6 OFM Labor Relations Service Acct-Non-Appropriated",null,null,null,null,null,null,null,null,null,null,null,null,null,null,null,null,null,null,null,null,"225","515-6","225515-6",0]
[null,"235-Department of Labor and Industries","608-2 Accident Account-Federal",{"$f":"LEFT(ActiveFunds!$C312,5)","v":"608-2"},{"$f":"IFERROR(IF(VLOOKUP(D312,#REF!,2,0)=\"O\",0,IF(VLOOKUP(D312,#REF!,2,0)=\"T\",1,0)),\"ERROR\")","v":"ERROR"},null,null,null,null,"438-6","438-6 Uniform Dental Plan Benefits Admin-Non-Appropriated",null,null,null,null,null,null,null,null,null,null,null,null,null,null,null,null,null,null,null,null,"227","001-1","227001-1",0]
[null,"235-Department of Labor and Industries","608-3 Accident Account-Federal Unanticipated",{"$f":"LEFT(ActiveFunds!$C313,5)","v":"608-3"},{"$f":"IFERROR(IF(VLOOKUP(D313,#REF!,2,0)=\"O\",0,IF(VLOOKUP(D313,#REF!,2,0)=\"T\",1,0)),\"ERROR\")","v":"ERROR"},null,null,null,null,"439-6","439-6 Uniform Medical Plan Benefits Acct-Non-Appropriated",null,null,null,null,null,null,null,null,null,null,null,null,null,null,null,null,null,null,null,null,"227","001-7","227001-7",0]
[null,"235-Department of Labor and Industries","608-6 Accident Account-Non-Appropriated",{"$f":"LEFT(ActiveFunds!$C314,5)","v":"608-6"},{"$f":"IFERROR(IF(VLOOKUP(D314,#REF!,2,0)=\"O\",0,IF(VLOOKUP(D314,#REF!,2,0)=\"T\",1,0)),\"ERROR\")","v":"ERROR"},null,null,null,null,"440-6","440-6 Inst of Hi Ed-Stores Account-Non-Appropriated",null,null,null,null,null,null,null,null,null,null,null,null,null,null,null,null,null,null,null,null,"227","02K-1","22702K-1",0]
[null,"235-Department of Labor and Industries","608-9 Accident Account-Private/Local Unanticipated",{"$f":"LEFT(ActiveFunds!$C315,5)","v":"608-9"},{"$f":"IFERROR(IF(VLOOKUP(D315,#REF!,2,0)=\"O\",0,IF(VLOOKUP(D315,#REF!,2,0)=\"T\",1,0)),\"ERROR\")","v":"ERROR"},null,null,null,null,"441-1","441-1 Local Government Archives Account-State",null,null,null,null,null,null,null,null,null,null,null,null,null,null,null,null,null,null,null,null,"227","03M-1","22703M-1",0]
[null,"235-Department of Labor and Industries","609-1 Medical Aid Account-State",{"$f":"LEFT(ActiveFunds!$C316,5)","v":"609-1"},{"$f":"IFERROR(IF(VLOOKUP(D316,#REF!,2,0)=\"O\",0,IF(VLOOKUP(D316,#REF!,2,0)=\"T\",1,0)),\"ERROR\")","v":"ERROR"},null,null,null,null,"442-6","442-6 Legislative Gift Center Account-Non-Appropriated",null,null,null,null,null,null,null,null,null,null,null,null,null,null,null,null,null,null,null,null,"227","11K-1","22711K-1",0]
[null,"235-Department of Labor and Industries","609-2 Medical Aid Account-Federal",{"$f":"LEFT(ActiveFunds!$C317,5)","v":"609-2"},{"$f":"IFERROR(IF(VLOOKUP(D317,#REF!,2,0)=\"O\",0,IF(VLOOKUP(D317,#REF!,2,0)=\"T\",1,0)),\"ERROR\")","v":"ERROR"},null,null,null,null,"443-6","443-6 Inst of Hi Ed-Data Processing Acct-Non-Appropriated",null,null,null,null,null,null,null,null,null,null,null,null,null,null,null,null,null,null,null,null,"227","18K-1","22718K-1",0]
[null,"235-Department of Labor and Industries","609-3 Medical Aid Account-Federal Unanticipated",{"$f":"LEFT(ActiveFunds!$C318,5)","v":"609-3"},{"$f":"IFERROR(IF(VLOOKUP(D318,#REF!,2,0)=\"O\",0,IF(VLOOKUP(D318,#REF!,2,0)=\"T\",1,0)),\"ERROR\")","v":"ERROR"},null,null,null,null,"444-6","444-6 Fish & Wildlife Equip Revolv Acct-Non-Appropriated",null,null,null,null,null,null,null,null,null,null,null,null,null,null,null,null,null,null,null,null,"235","001-1","235001-1",0]
[null,"235-Department of Labor and Industries","609-6 Medical Aid Account-Non-Appropriated",{"$f":"LEFT(ActiveFunds!$C319,5)","v":"609-6"},{"$f":"IFERROR(IF(VLOOKUP(D319,#REF!,2,0)=\"O\",0,IF(VLOOKUP(D319,#REF!,2,0)=\"T\",1,0)),\"ERROR\")","v":"ERROR"},null,null,null,null,"445-6","445-6 Self Insur Emp Overpay Reim Acct-Non-Appropriated",null,null,null,null,null,null,null,null,null,null,null,null,null,null,null,null,null,null,null,null,"235","001-2","235001-2",0]
[null,"235-Department of Labor and Industries","609-9 Medical Aid Account-Private/Local Unanticipated",{"$f":"LEFT(ActiveFunds!$C320,5)","v":"609-9"},{"$f":"IFERROR(IF(VLOOKUP(D320,#REF!,2,0)=\"O\",0,IF(VLOOKUP(D320,#REF!,2,0)=\"T\",1,0)),\"ERROR\")","v":"ERROR"},null,null,null,null,"447-6","447-6 Info Tech Invest Rev Acct-Non-Appropriated",null,null,null,null,null,null,null,null,null,null,null,null,null,null,null,null,null,null,null,null,"235","01F-6","23501F-6",0]
[null,"235-Department of Labor and Industries","610-6 Accident Reserve Account-Non-Appropriated",{"$f":"LEFT(ActiveFunds!$C321,5)","v":"610-6"},{"$f":"IFERROR(IF(VLOOKUP(D321,#REF!,2,0)=\"O\",0,IF(VLOOKUP(D321,#REF!,2,0)=\"T\",1,0)),\"ERROR\")","v":"ERROR"},null,null,null,null,"448-6","448-6 Inst of Hi Ed-Printing Account-Non-Appropriated",null,null,null,null,null,null,null,null,null,null,null,null,null,null,null,null,null,null,null,null,"235","03B-1","23503B-1",0]
[null,"235-Department of Labor and Industries","881-6 Supplemental Pension Account-Non-Appropriated",{"$f":"LEFT(ActiveFunds!$C322,5)","v":"881-6"},{"$f":"IFERROR(IF(VLOOKUP(D322,#REF!,2,0)=\"O\",0,IF(VLOOKUP(D322,#REF!,2,0)=\"T\",1,0)),\"ERROR\")","v":"ERROR"},null,null,null,null,"450-6","450-6 Inst of Hi Ed-Other Facilities Acct-Non-Appropriated",null,null,null,null,null,null,null,null,null,null,null,null,null,null,null,null,null,null,null,null,"235","095-1","235095-1",0]
[null,"235-Department of Labor and Industries","883-6 Second Injury Account-Non-Appropriated",{"$f":"LEFT(ActiveFunds!$C323,5)","v":"883-6"},{"$f":"IFERROR(IF(VLOOKUP(D323,#REF!,2,0)=\"O\",0,IF(VLOOKUP(D323,#REF!,2,0)=\"T\",1,0)),\"ERROR\")","v":"ERROR"},null,null,null,null,"453-1","453-1 OMWBE Enterprises Account-State",null,null,null,null,null,null,null,null,null,null,null,null,null,null,null,null,null,null,null,null,"235","162-1","235162-1",0]
[null,"235-Department of Labor and Industries","885-1 Plumbing Certificate Account-State",{"$f":"LEFT(ActiveFunds!$C324,5)","v":"885-1"},{"$f":"IFERROR(IF(VLOOKUP(D324,#REF!,2,0)=\"O\",0,IF(VLOOKUP(D324,#REF!,2,0)=\"T\",1,0)),\"ERROR\")","v":"ERROR"},null,null,null,null,"455-1","455-1 Higher Education Personnel Services-State",null,null,null,null,null,null,null,null,null,null,null,null,null,null,null,null,null,null,null,null,"235","163-1","235163-1",0]
[null,"235-Department of Labor and Industries","892-1 Pressure Systems Safety Account-State",{"$f":"LEFT(ActiveFunds!$C325,5)","v":"892-1"},{"$f":"IFERROR(IF(VLOOKUP(D325,#REF!,2,0)=\"O\",0,IF(VLOOKUP(D325,#REF!,2,0)=\"T\",1,0)),\"ERROR\")","v":"ERROR"},null,null,null,null,{"$f":"MID(K325,1,5)","v":"457-6"},"457-6 Higher Ed Retirement Benefits Revol-Non-Appropriated",null,null,null,null,null,null,null,null,null,null,null,null,null,null,null,null,null,null,null,null,"235","234-1","235234-1",0]
[null,"240-Department of Licensing","001-1 General Fund-State",{"$f":"LEFT(ActiveFunds!$C326,5)","v":"001-1"},{"$f":"IFERROR(IF(VLOOKUP(D326,#REF!,2,0)=\"O\",0,IF(VLOOKUP(D326,#REF!,2,0)=\"T\",1,0)),\"ERROR\")","v":"ERROR"},null,null,null,null,"458-1","458-1 Consolidated Tech Services Rev Acct-State",null,null,null,null,null,null,null,null,null,null,null,null,null,null,null,null,null,null,null,null,"235","262-1",{"$f":"AF326&AG326","v":"235262-1"},0]
[null,"240-Department of Licensing","003-1 Architects' License Account-State",{"$f":"LEFT(ActiveFunds!$C327,5)","v":"003-1"},{"$f":"IFERROR(IF(VLOOKUP(D327,#REF!,2,0)=\"O\",0,IF(VLOOKUP(D327,#REF!,2,0)=\"T\",1,0)),\"ERROR\")","v":"ERROR"},null,null,null,null,"458-6","458-6 Consolidated Tech Services Rev Acct-Non-Appropriated",null,null,null,null,null,null,null,null,null,null,null,null,null,null,null,null,null,null,null,null,"235","445-6","235445-6",0]
[null,"240-Department of Licensing","024-1 Professional Engineers' Account-State",{"$f":"LEFT(ActiveFunds!$C328,5)","v":"024-1"},{"$f":"IFERROR(IF(VLOOKUP(D328,#REF!,2,0)=\"O\",0,IF(VLOOKUP(D328,#REF!,2,0)=\"T\",1,0)),\"ERROR\")","v":"ERROR"},null,null,null,null,"458-9","458-9 Consolidated Tech Services Rev Acct-Private/Local Unanticipated",null,null,null,null,null,null,null,null,null,null,null,null,null,null,null,null,null,null,null,null,"235","608-1","235608-1",0]
[null,"240-Department of Licensing","026-1 Real Estate Commission Account-State",{"$f":"LEFT(ActiveFunds!$C329,5)","v":"026-1"},{"$f":"IFERROR(IF(VLOOKUP(D329,#REF!,2,0)=\"O\",0,IF(VLOOKUP(D329,#REF!,2,0)=\"T\",1,0)),\"ERROR\")","v":"ERROR"},null,null,null,null,"460-6","460-6 Inst of Hi Ed-Motor Pool Account-Non-Appropriated",null,null,null,null,null,null,null,null,null,null,null,null,null,null,null,null,null,null,null,null,"235","608-2","235608-2",0]
[null,"240-Department of Licensing","03K-6 Industrial Insurance Premium Refund-Non-Appropriated",{"$f":"LEFT(ActiveFunds!$C330,5)","v":"03K-6"},{"$f":"IFERROR(IF(VLOOKUP(D330,#REF!,2,0)=\"O\",0,IF(VLOOKUP(D330,#REF!,2,0)=\"T\",1,0)),\"ERROR\")","v":"ERROR"},null,null,null,null,"461-6","461-6 Shared IT Systems Revolving Acct-Non-Appropriated",null,null,null,null,null,null,null,null,null,null,null,null,null,null,null,null,null,null,null,null,"235","608-6","235608-6",0]
[null,"240-Department of Licensing","048-1 Marine Fuel Tax Refund Account-State",{"$f":"LEFT(ActiveFunds!$C331,5)","v":"048-1"},{"$f":"IFERROR(IF(VLOOKUP(D331,#REF!,2,0)=\"O\",0,IF(VLOOKUP(D331,#REF!,2,0)=\"T\",1,0)),\"ERROR\")","v":"ERROR"},null,null,null,null,"466-1","466-1 Statewide IT System Devel Rev Acct-State",null,null,null,null,null,null,null,null,null,null,null,null,null,null,null,null,null,null,null,null,"235","609-1","235609-1",0]
[null,"240-Department of Licensing","04E-1 Uniform Commercial Code Account-State",{"$f":"LEFT(ActiveFunds!$C332,5)","v":"04E-1"},{"$f":"IFERROR(IF(VLOOKUP(D332,#REF!,2,0)=\"O\",0,IF(VLOOKUP(D332,#REF!,2,0)=\"T\",1,0)),\"ERROR\")","v":"ERROR"},null,null,null,null,"468-1","468-1 OFM Central Services-State",null,null,null,null,null,null,null,null,null,null,null,null,null,null,null,null,null,null,null,null,"235","609-2","235609-2",0]
[null,"240-Department of Licensing","04F-1 Real Estate Education Program Acct-State",{"$f":"LEFT(ActiveFunds!$C333,5)","v":"04F-1"},{"$f":"IFERROR(IF(VLOOKUP(D333,#REF!,2,0)=\"O\",0,IF(VLOOKUP(D333,#REF!,2,0)=\"T\",1,0)),\"ERROR\")","v":"ERROR"},null,null,null,null,"470-6","470-6 Imaging Account-Non-Appropriated",null,null,null,null,null,null,null,null,null,null,null,null,null,null,null,null,null,null,null,null,"235","609-6","235609-6",0]
[null,"240-Department of Licensing","06G-1 Real Estate Appraiser Comm Acct-State",{"$f":"LEFT(ActiveFunds!$C334,5)","v":"06G-1"},{"$f":"IFERROR(IF(VLOOKUP(D334,#REF!,2,0)=\"O\",0,IF(VLOOKUP(D334,#REF!,2,0)=\"T\",1,0)),\"ERROR\")","v":"ERROR"},null,null,null,null,"471-6","471-6 State Patrol N Air Rev Account-Non-Appropriated",null,null,null,null,null,null,null,null,null,null,null,null,null,null,null,null,null,null,null,null,"235","885-1","235885-1",0]
[null,"240-Department of Licensing","06L-1 Business & Professions Account-State",{"$f":"LEFT(ActiveFunds!$C335,5)","v":"06L-1"},{"$f":"IFERROR(IF(VLOOKUP(D335,#REF!,2,0)=\"O\",0,IF(VLOOKUP(D335,#REF!,2,0)=\"T\",1,0)),\"ERROR\")","v":"ERROR"},null,null,null,null,"472-6","472-6 Statewide IT Systems M&O Rev Acct-Non-Appropriated",null,null,null,null,null,null,null,null,null,null,null,null,null,null,null,null,null,null,null,null,"235","892-1","235892-1",0]
[null,"240-Department of Licensing","06R-1 Real Estate Research Account-State",{"$f":"LEFT(ActiveFunds!$C336,5)","v":"06R-1"},{"$f":"IFERROR(IF(VLOOKUP(D336,#REF!,2,0)=\"O\",0,IF(VLOOKUP(D336,#REF!,2,0)=\"T\",1,0)),\"ERROR\")","v":"ERROR"},null,null,null,null,"480-6","480-6 Financial Education Public-Private-Non-Appropriated",null,null,null,null,null,null,null,null,null,null,null,null,null,null,null,null,null,null,null,null,"240","001-1","240001-1",0]
[null,"240-Department of Licensing","06T-1 License Plate Technology Account-State",{"$f":"LEFT(ActiveFunds!$C337,5)","v":"06T-1"},{"$f":"IFERROR(IF(VLOOKUP(D337,#REF!,2,0)=\"O\",0,IF(VLOOKUP(D337,#REF!,2,0)=\"T\",1,0)),\"ERROR\")","v":"ERROR"},null,null,null,null,"483-1","483-1 Auditing Services Revolving Acct-State",null,null,null,null,null,null,null,null,null,null,null,null,null,null,null,null,null,null,null,null,"240","003-1","240003-1",0]
[null,"240-Department of Licensing","082-1 Motorcycle Safety Education Account-State",{"$f":"LEFT(ActiveFunds!$C338,5)","v":"082-1"},{"$f":"IFERROR(IF(VLOOKUP(D338,#REF!,2,0)=\"O\",0,IF(VLOOKUP(D338,#REF!,2,0)=\"T\",1,0)),\"ERROR\")","v":"ERROR"},null,null,null,null,"484-1","484-1 Administrative Hearings Revolving-State",null,null,null,null,null,null,null,null,null,null,null,null,null,null,null,null,null,null,null,null,"240","024-1","240024-1",0]
[null,"240-Department of Licensing","104-1 State Wildlife Account-State",{"$f":"LEFT(ActiveFunds!$C339,5)","v":"104-1"},{"$f":"IFERROR(IF(VLOOKUP(D339,#REF!,2,0)=\"O\",0,IF(VLOOKUP(D339,#REF!,2,0)=\"T\",1,0)),\"ERROR\")","v":"ERROR"},null,null,null,null,"485-6","485-6 Horse Racing Comm-WA Bred Owners'-Non-Appropriated",null,null,null,null,null,null,null,null,null,null,null,null,null,null,null,null,null,null,null,null,"240","026-1","240026-1",0]
[null,"240-Department of Licensing","106-1 Highway Safety Account-State",{"$f":"LEFT(ActiveFunds!$C340,5)","v":"106-1"},{"$f":"IFERROR(IF(VLOOKUP(D340,#REF!,2,0)=\"O\",0,IF(VLOOKUP(D340,#REF!,2,0)=\"T\",1,0)),\"ERROR\")","v":"ERROR"},null,null,null,null,"495-6","495-6 Toll Collection Account-Non-Appropriated",null,null,null,null,null,null,null,null,null,null,null,null,null,null,null,null,null,null,null,null,"240","04E-1","24004E-1",0]
[null,"240-Department of Licensing","106-2 Highway Safety Account-Federal",{"$f":"LEFT(ActiveFunds!$C341,5)","v":"106-2"},{"$f":"IFERROR(IF(VLOOKUP(D341,#REF!,2,0)=\"O\",0,IF(VLOOKUP(D341,#REF!,2,0)=\"T\",1,0)),\"ERROR\")","v":"ERROR"},null,null,null,null,"496-6","496-6 Future Teachers Condtnl Scholarship-Non-Appropriated",null,null,null,null,null,null,null,null,null,null,null,null,null,null,null,null,null,null,null,null,"240","04F-1","24004F-1",0]
[null,"240-Department of Licensing","106-9 Highway Safety Account-Private/Local Unanticipated",{"$f":"LEFT(ActiveFunds!$C342,5)","v":"106-9"},{"$f":"IFERROR(IF(VLOOKUP(D342,#REF!,2,0)=\"O\",0,IF(VLOOKUP(D342,#REF!,2,0)=\"T\",1,\"Error\")),\"ERROR\")","v":"ERROR"},null,null,null,null,"497-6","497-6 Horse Racing Comm Class C Purse-Non-Appropriated",null,null,null,null,null,null,null,null,null,null,null,null,null,null,null,null,null,null,null,null,"240","06G-1","24006G-1",0]
[null,"240-Department of Licensing","108-1 Motor Vehicle Account-State",{"$f":"LEFT(ActiveFunds!$C343,5)","v":"108-1"},{"$f":"IFERROR(IF(VLOOKUP(D343,#REF!,2,0)=\"O\",0,IF(VLOOKUP(D343,#REF!,2,0)=\"T\",1,0)),\"ERROR\")","v":"ERROR"},null,null,null,null,"501-1","501-1 Liquor Revolving Account-State",null,null,null,null,null,null,null,null,null,null,null,null,null,null,null,null,null,null,null,null,"240","06L-1","24006L-1",0]
[null,"240-Department of Licensing","108-2 Motor Vehicle Account-Federal",{"$f":"LEFT(ActiveFunds!$C344,5)","v":"108-2"},{"$f":"IFERROR(IF(VLOOKUP(D344,#REF!,2,0)=\"O\",0,IF(VLOOKUP(D344,#REF!,2,0)=\"T\",1,0)),\"ERROR\")","v":"ERROR"},null,null,null,null,"503-6","503-6 Tuition Recovery Trust Fund-Non-Appropriated",null,null,null,null,null,null,null,null,null,null,null,null,null,null,null,null,null,null,null,null,"240","06R-1","24006R-1",0]
[null,"240-Department of Licensing","108-7 Motor Vehicle Account-Private/Local",{"$f":"LEFT(ActiveFunds!$C345,5)","v":"108-7"},{"$f":"IFERROR(IF(VLOOKUP(D345,#REF!,2,0)=\"O\",0,IF(VLOOKUP(D345,#REF!,2,0)=\"T\",1,0)),\"ERROR\")","v":"ERROR"},null,null,null,null,"505-6","505-6 University of Washington Hospital-Non-Appropriated",null,null,null,null,null,null,null,null,null,null,null,null,null,null,null,null,null,null,null,null,"240","15V-6","24015V-6",0]
[null,"240-Department of Licensing","14V-1 Ignition Interlock Device Revolving-State",{"$f":"LEFT(ActiveFunds!$C346,5)","v":"14V-1"},{"$f":"IFERROR(IF(VLOOKUP(D346,#REF!,2,0)=\"O\",0,IF(VLOOKUP(D346,#REF!,2,0)=\"T\",1,0)),\"ERROR\")","v":"ERROR"},null,null,null,null,"507-1","507-1 Oyster Reserve Land Account-State",null,null,null,null,null,null,null,null,null,null,null,null,null,null,null,null,null,null,null,null,"240","16B-6","24016B-6",0]
[null,"240-Department of Licensing","15V-6 Funeral and Cemetery Account-Non-Appropriated",{"$f":"LEFT(ActiveFunds!$C347,5)","v":"15V-6"},{"$f":"IFERROR(IF(VLOOKUP(D347,#REF!,2,0)=\"O\",0,IF(VLOOKUP(D347,#REF!,2,0)=\"T\",1,0)),\"ERROR\")","v":"ERROR"},null,null,null,null,"508-6","508-6 Miscellaneous Enterprise Activities-Non-Appropriated",null,null,null,null,null,null,null,null,null,null,null,null,null,null,null,null,null,null,null,null,"240","16M-6","24016M-6",0]
[null,"240-Department of Licensing","16B-6 Landscape Architects' License Acct-Non-Appropriated",{"$f":"LEFT(ActiveFunds!$C348,5)","v":"16B-6"},{"$f":"IFERROR(IF(VLOOKUP(D348,#REF!,2,0)=\"O\",0,IF(VLOOKUP(D348,#REF!,2,0)=\"T\",1,0)),\"ERROR\")","v":"ERROR"},null,null,null,null,"511-1","511-1 Tacoma Narrows Toll Bridge Account-State",null,null,null,null,null,null,null,null,null,null,null,null,null,null,null,null,null,null,null,null,"240","298-1","240298-1",0]
[null,"240-Department of Licensing","16M-6 Appraisal Management Company Acct-Non-Appropriated",{"$f":"LEFT(ActiveFunds!$C349,5)","v":"16M-6"},{"$f":"IFERROR(IF(VLOOKUP(D349,#REF!,2,0)=\"O\",0,IF(VLOOKUP(D349,#REF!,2,0)=\"T\",1,0)),\"ERROR\")","v":"ERROR"},null,null,null,null,"512-6","512-6 Institutional Stores Account-Non-Appropriated",null,null,null,null,null,null,null,null,null,null,null,null,null,null,null,null,null,null,null,null,"240","298-6","240298-6",0]
[null,"240-Department of Licensing","201-1 DOL Services Account-State",{"$f":"LEFT(ActiveFunds!$C350,5)","v":"201-1"},{"$f":"IFERROR(IF(VLOOKUP(D350,#REF!,2,0)=\"O\",0,IF(VLOOKUP(D350,#REF!,2,0)=\"T\",1,0)),\"ERROR\")","v":"ERROR"},null,null,null,null,"513-1","513-1 Derelict Vessel Removal Account-State",null,null,null,null,null,null,null,null,null,null,null,null,null,null,null,null,null,null,null,null,"240","513-1","240513-1",0]
[null,"240-Department of Licensing","277-6 State Agency Parking Account-Non-Appropriated",{"$f":"LEFT(ActiveFunds!$C351,5)","v":"277-6"},{"$f":"IFERROR(IF(VLOOKUP(D351,#REF!,2,0)=\"O\",0,IF(VLOOKUP(D351,#REF!,2,0)=\"T\",1,0)),\"ERROR\")","v":"ERROR"},null,null,null,null,"515-6","515-6 DNA Data Base Account-Non-Appropriated",null,null,null,null,null,null,null,null,null,null,null,null,null,null,null,null,null,null,null,null,"245","001-1","245001-1",0]
[null,"240-Department of Licensing","298-1 Geologists' Account-State",{"$f":"LEFT(ActiveFunds!$C352,5)","v":"298-1"},{"$f":"IFERROR(IF(VLOOKUP(D352,#REF!,2,0)=\"O\",0,IF(VLOOKUP(D352,#REF!,2,0)=\"T\",1,0)),\"ERROR\")","v":"ERROR"},null,null,null,null,"516-6","516-6 Fruit and Vegetable Inspection Acct-Non-Appropriated",null,null,null,null,null,null,null,null,null,null,null,null,null,null,null,null,null,null,null,null,"245","001-2","245001-2",0]
[null,"240-Department of Licensing","298-6 Geologists' Account-Non-Appropriated",{"$f":"LEFT(ActiveFunds!$C353,5)","v":"298-6"},{"$f":"IFERROR(IF(VLOOKUP(D353,#REF!,2,0)=\"O\",0,IF(VLOOKUP(D353,#REF!,2,0)=\"T\",1,0)),\"ERROR\")","v":"ERROR"},null,null,null,null,"522-6","522-6 Inst of Hi Ed-Associated Students'-Non-Appropriated",null,null,null,null,null,null,null,null,null,null,null,null,null,null,null,null,null,null,null,null,"245","03F-1","24503F-1",0]
[null,"240-Department of Licensing","513-1 Derelict Vessel Removal Account-State",{"$f":"LEFT(ActiveFunds!$C354,5)","v":"513-1"},{"$f":"IFERROR(IF(VLOOKUP(D354,#REF!,2,0)=\"O\",0,IF(VLOOKUP(D354,#REF!,2,0)=\"T\",1,0)),\"ERROR\")","v":"ERROR"},null,null,null,null,"523-6","523-6 Public Funds Investment Account-Non-Appropriated",null,null,null,null,null,null,null,null,null,null,null,null,null,null,null,null,null,null,null,null,"245","05H-1","24505H-1",0]
[null,"245-Military Department","001-1 General Fund-State",{"$f":"LEFT(ActiveFunds!$C355,5)","v":"001-1"},{"$f":"IFERROR(IF(VLOOKUP(D355,#REF!,2,0)=\"O\",0,IF(VLOOKUP(D355,#REF!,2,0)=\"T\",1,0)),\"ERROR\")","v":"ERROR"},null,null,null,null,"524-6","524-6 Inst of Hi Ed-Bookstore Account-Non-Appropriated",null,null,null,null,null,null,null,null,null,null,null,null,null,null,null,null,null,null,null,null,"245","05H-2","24505H-2",0]
[null,"245-Military Department","001-2 General Fund-Federal",{"$f":"LEFT(ActiveFunds!$C356,5)","v":"001-2"},{"$f":"IFERROR(IF(VLOOKUP(D356,#REF!,2,0)=\"O\",0,IF(VLOOKUP(D356,#REF!,2,0)=\"T\",1,0)),\"ERROR\")","v":"ERROR"},null,null,null,null,"526-6","526-6 Veterans' Memorial Account-Non-Appropriated",null,null,null,null,null,null,null,null,null,null,null,null,null,null,null,null,null,null,null,null,"245","08H-1","24508H-1",0]
[null,"245-Military Department","03F-1 Enhanced 911 Account-State",{"$f":"LEFT(ActiveFunds!$C357,5)","v":"03F-1"},{"$f":"IFERROR(IF(VLOOKUP(D357,#REF!,2,0)=\"O\",0,IF(VLOOKUP(D357,#REF!,2,0)=\"T\",1,0)),\"ERROR\")","v":"ERROR"},null,null,null,null,"528-6","528-6 Inst of Hi Ed-Parking Account-Non-Appropriated",null,null,null,null,null,null,null,null,null,null,null,null,null,null,null,null,null,null,null,null,"245","163-1","245163-1",0]
[null,"245-Military Department","03K-6 Industrial Insurance Premium Refund-Non-Appropriated",{"$f":"LEFT(ActiveFunds!$C358,5)","v":"03K-6"},{"$f":"IFERROR(IF(VLOOKUP(D358,#REF!,2,0)=\"O\",0,IF(VLOOKUP(D358,#REF!,2,0)=\"T\",1,0)),\"ERROR\")","v":"ERROR"},null,null,null,null,"532-1","532-1 Washington Housing Trust Account-State",null,null,null,null,null,null,null,null,null,null,null,null,null,null,null,null,null,null,null,null,"245","217-1","245217-1",0]
[null,"245-Military Department","05H-1 Disaster Response Account-State",{"$f":"LEFT(ActiveFunds!$C359,5)","v":"05H-1"},{"$f":"IFERROR(IF(VLOOKUP(D359,#REF!,2,0)=\"O\",0,IF(VLOOKUP(D359,#REF!,2,0)=\"T\",1,0)),\"ERROR\")","v":"ERROR"},null,null,null,null,"536-6","536-6 Federal Food Service Revolving Acct-Non-Appropriated",null,null,null,null,null,null,null,null,null,null,null,null,null,null,null,null,null,null,null,null,"275","001-1","275001-1",0]
[null,"245-Military Department","05H-2 Disaster Response Account-Federal",{"$f":"LEFT(ActiveFunds!$C360,5)","v":"05H-2"},{"$f":"IFERROR(IF(VLOOKUP(D360,#REF!,2,0)=\"O\",0,IF(VLOOKUP(D360,#REF!,2,0)=\"T\",1,0)),\"ERROR\")","v":"ERROR"},null,null,null,null,"543-1","543-1 Judicial Information Systems Acct-State",null,null,null,null,null,null,null,null,null,null,null,null,null,null,null,null,null,null,null,null,"275","415-1","275415-1",0]
[null,"245-Military Department","08H-1 Military Department Rent and Lease-State",{"$f":"LEFT(ActiveFunds!$C361,5)","v":"08H-1"},{"$f":"IFERROR(IF(VLOOKUP(D361,#REF!,2,0)=\"O\",0,IF(VLOOKUP(D361,#REF!,2,0)=\"T\",1,0)),\"ERROR\")","v":"ERROR"},null,null,null,null,"544-1","544-1 Pollution Liab Insurance Prog Trust-State",null,null,null,null,null,null,null,null,null,null,null,null,null,null,null,null,null,null,null,null,"275","455-1","275455-1",0]
[null,"245-Military Department","12H-6 Uniformed Service Shared Leave Pool-Non-Appropriated",{"$f":"LEFT(ActiveFunds!$C362,5)","v":"12H-6"},{"$f":"IFERROR(IF(VLOOKUP(D362,#REF!,2,0)=\"O\",0,IF(VLOOKUP(D362,#REF!,2,0)=\"T\",1,0)),\"ERROR\")","v":"ERROR"},null,null,null,null,"544-6","544-6 Pollution Liab Insurance Prog Trust-Non-Appropriated",null,null,null,null,null,null,null,null,null,null,null,null,null,null,null,null,null,null,null,null,"300","001-0","300001-0",0]
[null,"245-Military Department","163-1 Worker/Community Right to Know Acct-State",{"$f":"LEFT(ActiveFunds!$C363,5)","v":"163-1"},{"$f":"IFERROR(IF(VLOOKUP(D363,#REF!,2,0)=\"O\",0,IF(VLOOKUP(D363,#REF!,2,0)=\"T\",1,0)),\"ERROR\")","v":"ERROR"},null,null,null,null,"545-6","545-6 Heating Oil Pollution Liab Trust-Non-Appropriated",null,null,null,null,null,null,null,null,null,null,null,null,null,null,null,null,null,null,null,null,"300","001-1","300001-1",0]
[null,"245-Military Department","217-1 Oil Spill Prevention Account-State",{"$f":"LEFT(ActiveFunds!$C364,5)","v":"217-1"},{"$f":"IFERROR(IF(VLOOKUP(D364,#REF!,2,0)=\"O\",0,IF(VLOOKUP(D364,#REF!,2,0)=\"T\",1,0)),\"ERROR\")","v":"ERROR"},null,null,null,null,"546-6","546-6 Risk Management Administration Acct-Non-Appropriated",null,null,null,null,null,null,null,null,null,null,null,null,null,null,null,null,null,null,null,null,"300","001-2","300001-2",0]
[null,"275-Public Employment Relations Comm","001-1 General Fund-State",{"$f":"LEFT(ActiveFunds!$C365,5)","v":"001-1"},{"$f":"IFERROR(IF(VLOOKUP(D365,#REF!,2,0)=\"O\",0,IF(VLOOKUP(D365,#REF!,2,0)=\"T\",1,0)),\"ERROR\")","v":"ERROR"},null,null,null,null,"547-6","547-6 Liability Account-Non-Appropriated",null,null,null,null,null,null,null,null,null,null,null,null,null,null,null,null,null,null,null,null,"300","001-7","300001-7",0]
[null,"275-Public Employment Relations Comm","03K-6 Industrial Insurance Premium Refund-Non-Appropriated",{"$f":"LEFT(ActiveFunds!$C366,5)","v":"03K-6"},{"$f":"IFERROR(IF(VLOOKUP(D366,#REF!,2,0)=\"O\",0,IF(VLOOKUP(D366,#REF!,2,0)=\"T\",1,0)),\"ERROR\")","v":"ERROR"},null,null,null,null,"548-6","548-6 LEOFF Plan 2 Expense Fund-Non-Appropriated",null,null,null,null,null,null,null,null,null,null,null,null,null,null,null,null,null,null,null,null,"300","001-A","300001-A",0]
[null,"275-Public Employment Relations Comm","415-1 Personnel Service Account-State",{"$f":"LEFT(ActiveFunds!$C367,5)","v":"415-1"},{"$f":"IFERROR(IF(VLOOKUP(D367,#REF!,2,0)=\"O\",0,IF(VLOOKUP(D367,#REF!,2,0)=\"T\",1,0)),\"ERROR\")","v":"ERROR"},null,null,null,null,"549-2","549-2 Election Account-Federal",null,null,null,null,null,null,null,null,null,null,null,null,null,null,null,null,null,null,null,null,"300","001-C","300001-C",0]
[null,"275-Public Employment Relations Comm","455-1 Higher Education Personnel Services-State",{"$f":"LEFT(ActiveFunds!$C368,5)","v":"455-1"},{"$f":"IFERROR(IF(VLOOKUP(D368,#REF!,2,0)=\"O\",0,IF(VLOOKUP(D368,#REF!,2,0)=\"T\",1,0)),\"ERROR\")","v":"ERROR"},null,null,null,null,"550-1","550-1 Transportation 2003 Acct (Nickel)-State",null,null,null,null,null,null,null,null,null,null,null,null,null,null,null,null,null,null,null,null,"300","001-D","300001-D",0]
[null,"300-Dept of Social and Health Services","001-1 General Fund-State",{"$f":"LEFT(ActiveFunds!$C369,5)","v":"001-1"},{"$f":"IFERROR(IF(VLOOKUP(D369,#REF!,2,0)=\"O\",0,IF(VLOOKUP(D369,#REF!,2,0)=\"T\",1,0)),\"ERROR\")","v":"ERROR"},null,null,null,null,"553-1","553-1 Performance Audits of Govt Acct-State",null,null,null,null,null,null,null,null,null,null,null,null,null,null,null,null,null,null,null,null,"300","05C-1","30005C-1",0]
[null,"300-Dept of Social and Health Services","001-2 General Fund-Federal",{"$f":"LEFT(ActiveFunds!$C370,5)","v":"001-2"},{"$f":"IFERROR(IF(VLOOKUP(D370,#REF!,2,0)=\"O\",0,IF(VLOOKUP(D370,#REF!,2,0)=\"T\",1,0)),\"ERROR\")","v":"ERROR"},null,null,null,null,"553-6","553-6 Performance Audits of Govt Acct-Non-Appropriated",null,null,null,null,null,null,null,null,null,null,null,null,null,null,null,null,null,null,null,null,"300","07W-1","30007W-1",0]
[null,"300-Dept of Social and Health Services","001-3 General Fund-Federal Unanticipated",{"$f":"LEFT(ActiveFunds!$C371,5)","v":"001-3"},{"$f":"IFERROR(IF(VLOOKUP(D371,#REF!,2,0)=\"O\",0,IF(VLOOKUP(D371,#REF!,2,0)=\"T\",1,0)),\"ERROR\")","v":"ERROR"},null,null,null,null,"561-6","561-6 Comm/Tech College Innovation Accoun-Non-Appropriated",null,null,null,null,null,null,null,null,null,null,null,null,null,null,null,null,null,null,null,null,"300","08K-1","30008K-1",0]
[null,"300-Dept of Social and Health Services","001-7 General Fund-Private/Local",{"$f":"LEFT(ActiveFunds!$C372,5)","v":"001-7"},{"$f":"IFERROR(IF(VLOOKUP(D372,#REF!,2,0)=\"O\",0,IF(VLOOKUP(D372,#REF!,2,0)=\"T\",1,0)),\"ERROR\")","v":"ERROR"},null,null,null,null,"562-1","562-1 Skilled Nursing Facil Saf Net Trust-State",null,null,null,null,null,null,null,null,null,null,null,null,null,null,null,null,null,null,null,null,"300","11K-1","30011K-1",0]
[null,"300-Dept of Social and Health Services","001-9 General Fund-Private/Local Unanticipated",{"$f":"LEFT(ActiveFunds!$C373,5)","v":"001-9"},{"$f":"IFERROR(IF(VLOOKUP(D373,#REF!,2,0)=\"O\",0,IF(VLOOKUP(D373,#REF!,2,0)=\"T\",1,0)),\"ERROR\")","v":"ERROR"},null,null,null,null,"564-1","564-1 Water Pollution Ctrl Revl Admin-State",null,null,null,null,null,null,null,null,null,null,null,null,null,null,null,null,null,null,null,null,"300","120-1","300120-1",0]
[null,"300-Dept of Social and Health Services","03K-6 Industrial Insurance Premium Refund-Non-Appropriated",{"$f":"LEFT(ActiveFunds!$C374,5)","v":"03K-6"},{"$f":"IFERROR(IF(VLOOKUP(D374,#REF!,2,0)=\"O\",0,IF(VLOOKUP(D374,#REF!,2,0)=\"T\",1,0)),\"ERROR\")","v":"ERROR"},null,null,null,null,"566-1","566-1 Community Forest Trust Account-State",null,null,null,null,null,null,null,null,null,null,null,null,null,null,null,null,null,null,null,null,"300","12E-6","30012E-6",0]
[null,"300-Dept of Social and Health Services","05C-1 Criminal Justice Treatment Account-State",{"$f":"LEFT(ActiveFunds!$C375,5)","v":"05C-1"},{"$f":"IFERROR(IF(VLOOKUP(D375,#REF!,2,0)=\"O\",0,IF(VLOOKUP(D375,#REF!,2,0)=\"T\",1,0)),\"ERROR\")","v":"ERROR"},null,null,null,null,"569-6","569-6 Inst of Hi Ed-Food Services Account-Non-Appropriated",null,null,null,null,null,null,null,null,null,null,null,null,null,null,null,null,null,null,null,null,"300","12T-1","30012T-1",0]
[null,"300-Dept of Social and Health Services","07W-1 Domestic Violence Prevention Acct-State",{"$f":"LEFT(ActiveFunds!$C376,5)","v":"07W-1"},{"$f":"IFERROR(IF(VLOOKUP(D376,#REF!,2,0)=\"O\",0,IF(VLOOKUP(D376,#REF!,2,0)=\"T\",1,0)),\"ERROR\")","v":"ERROR"},null,null,null,null,"570-6","570-6 Inst of Hi Ed-Other Enterprises-Non-Appropriated",null,null,null,null,null,null,null,null,null,null,null,null,null,null,null,null,null,null,null,null,"300","18T-1","30018T-1",0]
[null,"300-Dept of Social and Health Services","08K-1 Problem Gambling Account-State",{"$f":"LEFT(ActiveFunds!$C377,5)","v":"08K-1"},{"$f":"IFERROR(IF(VLOOKUP(D377,#REF!,2,0)=\"O\",0,IF(VLOOKUP(D377,#REF!,2,0)=\"T\",1,0)),\"ERROR\")","v":"ERROR"},null,null,null,null,"571-1","571-1 Multiuse Roadway Safety Account-State",null,null,null,null,null,null,null,null,null,null,null,null,null,null,null,null,null,null,null,null,"300","20S-1","30020S-1",0]
[null,"300-Dept of Social and Health Services","11K-1 Washington Auto Theft Prevention-State",{"$f":"LEFT(ActiveFunds!$C378,5)","v":"11K-1"},{"$f":"IFERROR(IF(VLOOKUP(D378,#REF!,2,0)=\"O\",0,IF(VLOOKUP(D378,#REF!,2,0)=\"T\",1,0)),\"ERROR\")","v":"ERROR"},null,null,null,null,"573-6","573-6 Inst of Hi Ed-Housing & Food Acct-Non-Appropriated",null,null,null,null,null,null,null,null,null,null,null,null,null,null,null,null,null,null,null,null,"300","274-6","300274-6",0]
[null,"300-Dept of Social and Health Services","120-1 Administrative Contingency Account-State",{"$f":"LEFT(ActiveFunds!$C379,5)","v":"120-1"},{"$f":"IFERROR(IF(VLOOKUP(D379,#REF!,2,0)=\"O\",0,IF(VLOOKUP(D379,#REF!,2,0)=\"T\",1,0)),\"ERROR\")","v":"ERROR"},null,null,null,null,"575-6","575-6 Vocational Ed Revolving-Corrections-Non-Appropriated",null,null,null,null,null,null,null,null,null,null,null,null,null,null,null,null,null,null,null,null,"300","283-2","300283-2",0]
[null,"300-Dept of Social and Health Services","12E-6 Assisted Living Fac Temp Mgmt Acct-Non-Appropriated",{"$f":"LEFT(ActiveFunds!$C380,5)","v":"12E-6"},{"$f":"IFERROR(IF(VLOOKUP(D380,#REF!,2,0)=\"O\",0,IF(VLOOKUP(D380,#REF!,2,0)=\"T\",1,0)),\"ERROR\")","v":"ERROR"},null,null,null,null,"577-6","577-6 State Lottery Account-Non-Appropriated",null,null,null,null,null,null,null,null,null,null,null,null,null,null,null,null,null,null,null,null,"300","315-1","300315-1",0]
[null,"300-Dept of Social and Health Services","12T-1 Traumatic Brain Injury Account-State",{"$f":"LEFT(ActiveFunds!$C381,5)","v":"12T-1"},{"$f":"IFERROR(IF(VLOOKUP(D381,#REF!,2,0)=\"O\",0,IF(VLOOKUP(D381,#REF!,2,0)=\"T\",1,0)),\"ERROR\")","v":"ERROR"},null,null,null,null,"578-1","578-1 Lottery Administrative Account-State",null,null,null,null,null,null,null,null,null,null,null,null,null,null,null,null,null,null,null,null,"300","562-1","300562-1",0]
[null,"300-Dept of Social and Health Services","18T-1 Child and Family Reinvestment Acc-State",{"$f":"LEFT(ActiveFunds!$C382,5)","v":"18T-1"},{"$f":"IFERROR(IF(VLOOKUP(D382,#REF!,2,0)=\"O\",0,IF(VLOOKUP(D382,#REF!,2,0)=\"T\",1,0)),\"ERROR\")","v":"ERROR"},null,null,null,null,"595-1","595-1 I-405 Express Toll Lanes Operations-State",null,null,null,null,null,null,null,null,null,null,null,null,null,null,null,null,null,null,null,null,"303","001-1","303001-1",0]
[null,"300-Dept of Social and Health Services","20S-1 Gov's Behavioral Health Innovation-State",{"$f":"LEFT(ActiveFunds!$C383,5)","v":"20S-1"},{"$f":"IFERROR(IF(VLOOKUP(D383,#REF!,2,0)=\"O\",0,IF(VLOOKUP(D383,#REF!,2,0)=\"T\",1,0)),\"ERROR\")","v":"ERROR"},null,null,null,null,"600-1","600-1 Dept of Retirement Systems Expense-State",null,null,null,null,null,null,null,null,null,null,null,null,null,null,null,null,null,null,null,null,"303","001-2","303001-2",0]
[null,"300-Dept of Social and Health Services","274-6 Adult Family Home Account-Non-Appropriated",{"$f":"LEFT(ActiveFunds!$C384,5)","v":"274-6"},{"$f":"IFERROR(IF(VLOOKUP(D384,#REF!,2,0)=\"O\",0,IF(VLOOKUP(D384,#REF!,2,0)=\"T\",1,0)),\"ERROR\")","v":"ERROR"},null,null,null,null,"600-6","600-6 Dept of Retirement Systems Expense-Non-Appropriated",null,null,null,null,null,null,null,null,null,null,null,null,null,null,null,null,null,null,null,null,"303","001-7","303001-7",0]
[null,"300-Dept of Social and Health Services","283-2 Juvenile Acctbl Incentive Acct-Federal",{"$f":"LEFT(ActiveFunds!$C385,5)","v":"283-2"},{"$f":"IFERROR(IF(VLOOKUP(D385,#REF!,2,0)=\"O\",0,IF(VLOOKUP(D385,#REF!,2,0)=\"T\",1,0)),\"ERROR\")","v":"ERROR"},null,null,null,null,"608-1","608-1 Accident Account-State",null,null,null,null,null,null,null,null,null,null,null,null,null,null,null,null,null,null,null,null,"303","001-8","303001-8",0]
[null,"300-Dept of Social and Health Services","315-1 Dedicated Marijuana Account-State",{"$f":"LEFT(ActiveFunds!$C386,5)","v":"315-1"},{"$f":"IFERROR(IF(VLOOKUP(D386,#REF!,2,0)=\"O\",0,IF(VLOOKUP(D386,#REF!,2,0)=\"T\",1,0)),\"ERROR\")","v":"ERROR"},null,null,null,null,"608-2","608-2 Accident Account-Federal",null,null,null,null,null,null,null,null,null,null,null,null,null,null,null,null,null,null,null,null,"303","002-1","303002-1",0]
[null,"300-Dept of Social and Health Services","447-6 Info Tech Invest Rev Acct-Non-Appropriated",{"$f":"LEFT(ActiveFunds!$C387,5)","v":"447-6"},{"$f":"IFERROR(IF(VLOOKUP(D387,#REF!,2,0)=\"O\",0,IF(VLOOKUP(D387,#REF!,2,0)=\"T\",1,0)),\"ERROR\")","v":"ERROR"},null,null,null,null,"608-3","608-3 Accident Account-Federal Unanticipated",null,null,null,null,null,null,null,null,null,null,null,null,null,null,null,null,null,null,null,null,"303","02G-1","30302G-1",0]
[null,"300-Dept of Social and Health Services","512-6 Institutional Stores Account-Non-Appropriated",{"$f":"LEFT(ActiveFunds!$C388,5)","v":"512-6"},{"$f":"IFERROR(IF(VLOOKUP(D388,#REF!,2,0)=\"O\",0,IF(VLOOKUP(D388,#REF!,2,0)=\"T\",1,0)),\"ERROR\")","v":"ERROR"},null,null,null,null,"608-6","608-6 Accident Account-Non-Appropriated",null,null,null,null,null,null,null,null,null,null,null,null,null,null,null,null,null,null,null,null,"303","02R-1","30302R-1",0]
[null,"300-Dept of Social and Health Services","562-1 Skilled Nursing Facil Saf Net Trust-State",{"$f":"LEFT(ActiveFunds!$C389,5)","v":"562-1"},{"$f":"IFERROR(IF(VLOOKUP(D389,#REF!,2,0)=\"O\",0,IF(VLOOKUP(D389,#REF!,2,0)=\"T\",1,0)),\"ERROR\")","v":"ERROR"},null,null,null,null,{"$f":"MID(K389,1,5)","v":"608-9"},"608-9 Accident Account-Private/Local Unanticipated",null,null,null,null,null,null,null,null,null,null,null,null,null,null,null,null,null,null,null,null,"303","03C-1","30303C-1",0]
[null,"300-Dept of Social and Health Services","800-6 Institutional Welfare/Betterment-Non-Appropriated",{"$f":"LEFT(ActiveFunds!$C390,5)","v":"800-6"},{"$f":"IFERROR(IF(VLOOKUP(D390,#REF!,2,0)=\"O\",0,IF(VLOOKUP(D390,#REF!,2,0)=\"T\",1,0)),\"ERROR\")","v":"ERROR"},null,null,null,null,"609-1","609-1 Medical Aid Account-State",null,null,null,null,null,null,null,null,null,null,null,null,null,null,null,null,null,null,null,null,"303","03R-1",{"$f":"AF390&AG390","v":"30303R-1"},0]
[null,"303-Department of Health","001-1 General Fund-State",{"$f":"LEFT(ActiveFunds!$C391,5)","v":"001-1"},{"$f":"IFERROR(IF(VLOOKUP(D391,#REF!,2,0)=\"O\",0,IF(VLOOKUP(D391,#REF!,2,0)=\"T\",1,0)),\"ERROR\")","v":"ERROR"},null,null,null,null,"609-2","609-2 Medical Aid Account-Federal",null,null,null,null,null,null,null,null,null,null,null,null,null,null,null,null,null,null,null,null,"303","04R-2","30304R-2",0]
[null,"303-Department of Health","001-2 General Fund-Federal",{"$f":"LEFT(ActiveFunds!$C392,5)","v":"001-2"},{"$f":"IFERROR(IF(VLOOKUP(D392,#REF!,2,0)=\"O\",0,IF(VLOOKUP(D392,#REF!,2,0)=\"T\",1,0)),\"ERROR\")","v":"ERROR"},null,null,null,null,"609-3","609-3 Medical Aid Account-Federal Unanticipated",null,null,null,null,null,null,null,null,null,null,null,null,null,null,null,null,null,null,null,null,"303","04W-1","30304W-1",0]
[null,"303-Department of Health","001-7 General Fund-Private/Local",{"$f":"LEFT(ActiveFunds!$C393,5)","v":"001-7"},{"$f":"IFERROR(IF(VLOOKUP(D393,#REF!,2,0)=\"O\",0,IF(VLOOKUP(D393,#REF!,2,0)=\"T\",1,0)),\"ERROR\")","v":"ERROR"},null,null,null,null,"609-6","609-6 Medical Aid Account-Non-Appropriated",null,null,null,null,null,null,null,null,null,null,null,null,null,null,null,null,null,null,null,null,"303","05R-1","30305R-1",0]
[null,"303-Department of Health","001-8 General Fund-Federal ARRA",{"$f":"LEFT(ActiveFunds!$C394,5)","v":"001-8"},{"$f":"IFERROR(IF(VLOOKUP(D394,#REF!,2,0)=\"O\",0,IF(VLOOKUP(D394,#REF!,2,0)=\"T\",1,0)),\"ERROR\")","v":"ERROR"},null,null,null,null,"609-9","609-9 Medical Aid Account-Private/Local Unanticipated",null,null,null,null,null,null,null,null,null,null,null,null,null,null,null,null,null,null,null,null,"303","09L-6","30309L-6",0]
[null,"303-Department of Health","002-1 Hospital Data Collection Account-State",{"$f":"LEFT(ActiveFunds!$C395,5)","v":"002-1"},{"$f":"IFERROR(IF(VLOOKUP(D395,#REF!,2,0)=\"O\",0,IF(VLOOKUP(D395,#REF!,2,0)=\"T\",1,0)),\"ERROR\")","v":"ERROR"},null,null,null,null,"610-6","610-6 Accident Reserve Account-Non-Appropriated",null,null,null,null,null,null,null,null,null,null,null,null,null,null,null,null,null,null,null,null,"303","125-1","303125-1",0]
[null,"303-Department of Health","02G-1 Health Professions Account-State",{"$f":"LEFT(ActiveFunds!$C396,5)","v":"02G-1"},{"$f":"IFERROR(IF(VLOOKUP(D396,#REF!,2,0)=\"O\",0,IF(VLOOKUP(D396,#REF!,2,0)=\"T\",1,0)),\"ERROR\")","v":"ERROR"},null,null,null,null,"614-6","614-6 Vol Firefight/Rsrv Officers Princip-Non-Appropriated",null,null,null,null,null,null,null,null,null,null,null,null,null,null,null,null,null,null,null,null,"303","14J-6","30314J-6",0]
[null,"303-Department of Health","02R-1 Aquatic Lands Enhancement Account-State",{"$f":"LEFT(ActiveFunds!$C397,5)","v":"02R-1"},{"$f":"IFERROR(IF(VLOOKUP(D397,#REF!,2,0)=\"O\",0,IF(VLOOKUP(D397,#REF!,2,0)=\"T\",1,0)),\"ERROR\")","v":"ERROR"},null,null,null,null,"615-6","615-6 Washington State Patrol Retirement-Non-Appropriated",null,null,null,null,null,null,null,null,null,null,null,null,null,null,null,null,null,null,null,null,"303","15M-1","30315M-1",0]
[null,"303-Department of Health","03C-1 Emer Med Ser/Trauma Care Sys Trust-State",{"$f":"LEFT(ActiveFunds!$C398,5)","v":"03C-1"},{"$f":"IFERROR(IF(VLOOKUP(D398,#REF!,2,0)=\"O\",0,IF(VLOOKUP(D398,#REF!,2,0)=\"T\",1,0)),\"ERROR\")","v":"ERROR"},null,null,null,null,"616-6","616-6 Judges' Retirement Account-Non-Appropriated",null,null,null,null,null,null,null,null,null,null,null,null,null,null,null,null,null,null,null,null,"303","16G-6","30316G-6",0]
[null,"303-Department of Health","03R-1 Safe Drinking Water Account-State",{"$f":"LEFT(ActiveFunds!$C399,5)","v":"03R-1"},{"$f":"IFERROR(IF(VLOOKUP(D399,#REF!,2,0)=\"O\",0,IF(VLOOKUP(D399,#REF!,2,0)=\"T\",1,0)),\"ERROR\")","v":"ERROR"},null,null,null,null,"620-6","620-6 Unemployment Compensation Account-Non-Appropriated",null,null,null,null,null,null,null,null,null,null,null,null,null,null,null,null,null,null,null,null,"303","173-1","303173-1",0]
[null,"303-Department of Health","04R-2 Drinking Water Assistance Account-Federal",{"$f":"LEFT(ActiveFunds!$C400,5)","v":"04R-2"},{"$f":"IFERROR(IF(VLOOKUP(D400,#REF!,2,0)=\"O\",0,IF(VLOOKUP(D400,#REF!,2,0)=\"T\",1,0)),\"ERROR\")","v":"ERROR"},null,null,null,null,"622-6","622-6 Unemployment Comp Fed Emp Ben Pmt-Non-Appropriated",null,null,null,null,null,null,null,null,null,null,null,null,null,null,null,null,null,null,null,null,"303","19A-1","30319A-1",0]
[null,"303-Department of Health","04W-1 Waterworks Operator Certification-State",{"$f":"LEFT(ActiveFunds!$C401,5)","v":"04W-1"},{"$f":"IFERROR(IF(VLOOKUP(D401,#REF!,2,0)=\"O\",0,IF(VLOOKUP(D401,#REF!,2,0)=\"T\",1,0)),\"ERROR\")","v":"ERROR"},null,null,null,null,"630-6","630-6 WSP Retirement System Plan 2 Acct-Non-Appropriated",null,null,null,null,null,null,null,null,null,null,null,null,null,null,null,null,null,null,null,null,"303","202-1","303202-1",0]
[null,"303-Department of Health","05R-1 Drinking Water Assist Admin Acct-State",{"$f":"LEFT(ActiveFunds!$C402,5)","v":"05R-1"},{"$f":"IFERROR(IF(VLOOKUP(D402,#REF!,2,0)=\"O\",0,IF(VLOOKUP(D402,#REF!,2,0)=\"T\",1,0)),\"ERROR\")","v":"ERROR"},null,null,null,null,"631-6","631-6 Public Employees' Retire Sys Plan I-Non-Appropriated",null,null,null,null,null,null,null,null,null,null,null,null,null,null,null,null,null,null,null,null,"303","214-6","303214-6",0]
[null,"303-Department of Health","09L-6 Nursing Resource Center Account-Non-Appropriated",{"$f":"LEFT(ActiveFunds!$C403,5)","v":"09L-6"},{"$f":"IFERROR(IF(VLOOKUP(D403,#REF!,2,0)=\"O\",0,IF(VLOOKUP(D403,#REF!,2,0)=\"T\",1,0)),\"ERROR\")","v":"ERROR"},null,null,null,null,"632-6","632-6 Teachers' Retirement Plan I Acct-Non-Appropriated",null,null,null,null,null,null,null,null,null,null,null,null,null,null,null,null,null,null,null,null,"303","235-1","303235-1",0]
[null,"303-Department of Health","125-1 Site Closure Account-State",{"$f":"LEFT(ActiveFunds!$C404,5)","v":"125-1"},{"$f":"IFERROR(IF(VLOOKUP(D404,#REF!,2,0)=\"O\",0,IF(VLOOKUP(D404,#REF!,2,0)=\"T\",1,0)),\"ERROR\")","v":"ERROR"},null,null,null,null,"633-6","633-6 School Employee Comb Plan 2 & 3-Non-Appropriated",null,null,null,null,null,null,null,null,null,null,null,null,null,null,null,null,null,null,null,null,"303","315-1","303315-1",0]
[null,"303-Department of Health","14J-6 Ambulatory Surgical Facility Acct-Non-Appropriated",{"$f":"LEFT(ActiveFunds!$C405,5)","v":"14J-6"},{"$f":"IFERROR(IF(VLOOKUP(D405,#REF!,2,0)=\"O\",0,IF(VLOOKUP(D405,#REF!,2,0)=\"T\",1,0)),\"ERROR\")","v":"ERROR"},null,null,null,null,"635-6","635-6 Public Employees Retirement Plan 2-Non-Appropriated",null,null,null,null,null,null,null,null,null,null,null,null,null,null,null,null,null,null,null,null,"303","319-7","303319-7",0]
[null,"303-Department of Health","15M-1 Biotoxin Account-State",{"$f":"LEFT(ActiveFunds!$C406,5)","v":"15M-1"},{"$f":"IFERROR(IF(VLOOKUP(D406,#REF!,2,0)=\"O\",0,IF(VLOOKUP(D406,#REF!,2,0)=\"T\",1,0)),\"ERROR\")","v":"ERROR"},null,null,null,null,"641-6","641-6 Public Employees' Comb Plan 2 & 3-Non-Appropriated",null,null,null,null,null,null,null,null,null,null,null,null,null,null,null,null,null,null,null,null,"303","608-1","303608-1",0]
[null,"303-Department of Health","16G-6 Universal Vaccine Purchase Account-Non-Appropriated",{"$f":"LEFT(ActiveFunds!$C407,5)","v":"16G-6"},{"$f":"IFERROR(IF(VLOOKUP(D407,#REF!,2,0)=\"O\",0,IF(VLOOKUP(D407,#REF!,2,0)=\"T\",1,0)),\"ERROR\")","v":"ERROR"},null,null,null,null,"642-6","642-6 Teachers' Combined Plan II & III-Non-Appropriated",null,null,null,null,null,null,null,null,null,null,null,null,null,null,null,null,null,null,null,null,"303","609-1","303609-1",0]
[null,"303-Department of Health","173-1 State Toxics Control Account-State",{"$f":"LEFT(ActiveFunds!$C408,5)","v":"173-1"},{"$f":"IFERROR(IF(VLOOKUP(D408,#REF!,2,0)=\"O\",0,IF(VLOOKUP(D408,#REF!,2,0)=\"T\",1,0)),\"ERROR\")","v":"ERROR"},null,null,null,null,"687-6","687-6 Rural Rehabilitation Account-Non-Appropriated",null,null,null,null,null,null,null,null,null,null,null,null,null,null,null,null,null,null,null,null,"305","001-1","305001-1",0]
[null,"303-Department of Health","19A-1 Medicaid Fraud Penalty Account-State",{"$f":"LEFT(ActiveFunds!$C409,5)","v":"19A-1"},{"$f":"IFERROR(IF(VLOOKUP(D409,#REF!,2,0)=\"O\",0,IF(VLOOKUP(D409,#REF!,2,0)=\"T\",1,0)),\"ERROR\")","v":"ERROR"},null,null,null,null,"721-6","721-6 Public Employees/Retirees Insurance-Non-Appropriated",null,null,null,null,null,null,null,null,null,null,null,null,null,null,null,null,null,null,null,null,"305","001-2","305001-2",0]
[null,"303-Department of Health","202-1 Medical Test Site Licensure Account-State",{"$f":"LEFT(ActiveFunds!$C410,5)","v":"202-1"},{"$f":"IFERROR(IF(VLOOKUP(D410,#REF!,2,0)=\"O\",0,IF(VLOOKUP(D410,#REF!,2,0)=\"T\",1,0)),\"ERROR\")","v":"ERROR"},null,null,null,null,"722-6","722-6 Deferred Compensation Principal-Non-Appropriated",null,null,null,null,null,null,null,null,null,null,null,null,null,null,null,null,null,null,null,null,"305","001-7","305001-7",0]
[null,"303-Department of Health","214-6 Temporary Worker Housing Account-Non-Appropriated",{"$f":"LEFT(ActiveFunds!$C411,5)","v":"214-6"},{"$f":"IFERROR(IF(VLOOKUP(D411,#REF!,2,0)=\"O\",0,IF(VLOOKUP(D411,#REF!,2,0)=\"T\",1,0)),\"ERROR\")","v":"ERROR"},null,null,null,null,"727-1","727-1 Water Pollution Control Revolving-State",null,null,null,null,null,null,null,null,null,null,null,null,null,null,null,null,null,null,null,null,"305","042-1","305042-1",0]
[null,"303-Department of Health","235-1 Youth Tobacco/Vapor Prod Prev Acct-State",{"$f":"LEFT(ActiveFunds!$C412,5)","v":"235-1"},{"$f":"IFERROR(IF(VLOOKUP(D412,#REF!,2,0)=\"O\",0,IF(VLOOKUP(D412,#REF!,2,0)=\"T\",1,0)),\"ERROR\")","v":"ERROR"},null,null,null,null,"727-2","727-2 Water Pollution Control Revolving-Federal",null,null,null,null,null,null,null,null,null,null,null,null,null,null,null,null,null,null,null,null,"305","08V-6","30508V-6",0]
[null,"303-Department of Health","277-6 State Agency Parking Account-Non-Appropriated",{"$f":"LEFT(ActiveFunds!$C413,5)","v":"277-6"},{"$f":"IFERROR(IF(VLOOKUP(D413,#REF!,2,0)=\"O\",0,IF(VLOOKUP(D413,#REF!,2,0)=\"T\",1,0)),\"ERROR\")","v":"ERROR"},null,null,null,null,"729-6","729-6 Judicial Retirement Principal Acct-Non-Appropriated",null,null,null,null,null,null,null,null,null,null,null,null,null,null,null,null,null,null,null,null,"305","11V-7","30511V-7",0]
[null,"303-Department of Health","315-1 Dedicated Marijuana Account-State",{"$f":"LEFT(ActiveFunds!$C414,5)","v":"315-1"},{"$f":"IFERROR(IF(VLOOKUP(D414,#REF!,2,0)=\"O\",0,IF(VLOOKUP(D414,#REF!,2,0)=\"T\",1,0)),\"ERROR\")","v":"ERROR"},null,null,null,null,"731-6","731-6 Child Care Facility Revolving Acct-Non-Appropriated",null,null,null,null,null,null,null,null,null,null,null,null,null,null,null,null,null,null,null,null,"305","213-6","305213-6",0]
[null,"303-Department of Health","319-7 Public Health Supplemental Acct-Private/Local",{"$f":"LEFT(ActiveFunds!$C415,5)","v":"319-7"},{"$f":"IFERROR(IF(VLOOKUP(D415,#REF!,2,0)=\"O\",0,IF(VLOOKUP(D415,#REF!,2,0)=\"T\",1,0)),\"ERROR\")","v":"ERROR"},null,null,null,null,"746-6","746-6 Hanford Area Economic Investment-Non-Appropriated",null,null,null,null,null,null,null,null,null,null,null,null,null,null,null,null,null,null,null,null,"310","001-1","310001-1",0]
[null,"303-Department of Health","608-1 Accident Account-State",{"$f":"LEFT(ActiveFunds!$C416,5)","v":"608-1"},{"$f":"IFERROR(IF(VLOOKUP(D416,#REF!,2,0)=\"O\",0,IF(VLOOKUP(D416,#REF!,2,0)=\"T\",1,0)),\"ERROR\")","v":"ERROR"},null,null,null,null,"747-1","747-1 Health Prof Loan Repay/Scholar Prog-State",null,null,null,null,null,null,null,null,null,null,null,null,null,null,null,null,null,null,null,null,"310","001-2","310001-2",0]
[null,"303-Department of Health","609-1 Medical Aid Account-State",{"$f":"LEFT(ActiveFunds!$C417,5)","v":"609-1"},{"$f":"IFERROR(IF(VLOOKUP(D417,#REF!,2,0)=\"O\",0,IF(VLOOKUP(D417,#REF!,2,0)=\"T\",1,0)),\"ERROR\")","v":"ERROR"},null,null,null,null,"747-6","747-6 Health Prof Loan Repay/Scholar Prog-Non-Appropriated",null,null,null,null,null,null,null,null,null,null,null,null,null,null,null,null,null,null,null,null,"310","11K-1","31011K-1",0]
[null,"303-Department of Health","821-6 Impaired Physician Account-Non-Appropriated",{"$f":"LEFT(ActiveFunds!$C418,5)","v":"821-6"},{"$f":"IFERROR(IF(VLOOKUP(D418,#REF!,2,0)=\"O\",0,IF(VLOOKUP(D418,#REF!,2,0)=\"T\",1,0)),\"ERROR\")","v":"ERROR"},null,null,null,null,"749-6","749-6 Governor's ICSEW Account-Non-Appropriated",null,null,null,null,null,null,null,null,null,null,null,null,null,null,null,null,null,null,null,null,"310","141-6","310141-6",0]
[null,"305-Department of Veterans' Affairs","001-1 General Fund-State",{"$f":"LEFT(ActiveFunds!$C419,5)","v":"001-1"},{"$f":"IFERROR(IF(VLOOKUP(D419,#REF!,2,0)=\"O\",0,IF(VLOOKUP(D419,#REF!,2,0)=\"T\",1,0)),\"ERROR\")","v":"ERROR"},null,null,null,null,"759-6","759-6 Miscellaneous Program Account-Non-Appropriated",null,null,null,null,null,null,null,null,null,null,null,null,null,null,null,null,null,null,null,null,"310","173-1","310173-1",0]
[null,"305-Department of Veterans' Affairs","001-2 General Fund-Federal",{"$f":"LEFT(ActiveFunds!$C420,5)","v":"001-2"},{"$f":"IFERROR(IF(VLOOKUP(D420,#REF!,2,0)=\"O\",0,IF(VLOOKUP(D420,#REF!,2,0)=\"T\",1,0)),\"ERROR\")","v":"ERROR"},null,null,null,null,"776-6","776-6 WSU License Plate Account-Non-Appropriated",null,null,null,null,null,null,null,null,null,null,null,null,null,null,null,null,null,null,null,null,"310","206-6","310206-6",0]
[null,"305-Department of Veterans' Affairs","001-3 General Fund-Federal Unanticipated",{"$f":"LEFT(ActiveFunds!$C421,5)","v":"001-3"},{"$f":"IFERROR(IF(VLOOKUP(D421,#REF!,2,0)=\"O\",0,IF(VLOOKUP(D421,#REF!,2,0)=\"T\",1,0)),\"ERROR\")","v":"ERROR"},null,null,null,null,"777-1","777-1 Prostitution Prevent & Intervention-State",null,null,null,null,null,null,null,null,null,null,null,null,null,null,null,null,null,null,null,null,"310","226-6","310226-6",0]
[null,"305-Department of Veterans' Affairs","001-7 General Fund-Private/Local",{"$f":"LEFT(ActiveFunds!$C422,5)","v":"001-7"},{"$f":"IFERROR(IF(VLOOKUP(D422,#REF!,2,0)=\"O\",0,IF(VLOOKUP(D422,#REF!,2,0)=\"T\",1,0)),\"ERROR\")","v":"ERROR"},null,null,null,null,"778-6","778-6 WWU License Plate Account-Non-Appropriated",null,null,null,null,null,null,null,null,null,null,null,null,null,null,null,null,null,null,null,null,"310","401-6","310401-6",0]
[null,"305-Department of Veterans' Affairs","001-9 General Fund-Private/Local Unanticipated",{"$f":"LEFT(ActiveFunds!$C423,5)","v":"001-9"},{"$f":"IFERROR(IF(VLOOKUP(D423,#REF!,2,0)=\"O\",0,IF(VLOOKUP(D423,#REF!,2,0)=\"T\",1,0)),\"ERROR\")","v":"ERROR"},null,null,null,null,"779-6","779-6 EWU License Plate Account-Non-Appropriated",null,null,null,null,null,null,null,null,null,null,null,null,null,null,null,null,null,null,null,null,"310","419-1","310419-1",0]
[null,"305-Department of Veterans' Affairs","03K-6 Industrial Insurance Premium Refund-Non-Appropriated",{"$f":"LEFT(ActiveFunds!$C424,5)","v":"03K-6"},{"$f":"IFERROR(IF(VLOOKUP(D424,#REF!,2,0)=\"O\",0,IF(VLOOKUP(D424,#REF!,2,0)=\"T\",1,0)),\"ERROR\")","v":"ERROR"},null,null,null,null,"780-1","780-1 School Zone Safety Account-State",null,null,null,null,null,null,null,null,null,null,null,null,null,null,null,null,null,null,null,null,"315","001-1","315001-1",0]
[null,"305-Department of Veterans' Affairs","042-1 Char/Ed/Penal/Reform/Institutions-State",{"$f":"LEFT(ActiveFunds!$C425,5)","v":"042-1"},{"$f":"IFERROR(IF(VLOOKUP(D425,#REF!,2,0)=\"O\",0,IF(VLOOKUP(D425,#REF!,2,0)=\"T\",1,0)),\"ERROR\")","v":"ERROR"},null,null,null,null,"784-6","784-6 Misc Transportation Programs Acct-Non-Appropriated",null,null,null,null,null,null,null,null,null,null,null,null,null,null,null,null,null,null,null,null,"315","001-2","315001-2",0]
[null,"305-Department of Veterans' Affairs","08V-6 Veterans Stewardship Account-Non-Appropriated",{"$f":"LEFT(ActiveFunds!$C426,5)","v":"08V-6"},{"$f":"IFERROR(IF(VLOOKUP(D426,#REF!,2,0)=\"O\",0,IF(VLOOKUP(D426,#REF!,2,0)=\"T\",1,0)),\"ERROR\")","v":"ERROR"},null,null,null,null,"785-6","785-6 State Educational Trust Fund Acct-Non-Appropriated",null,null,null,null,null,null,null,null,null,null,null,null,null,null,null,null,null,null,null,null,"315","001-7","315001-7",0]
[null,"305-Department of Veterans' Affairs","11V-7 Veteran Estate Management Account-Private/Local",{"$f":"LEFT(ActiveFunds!$C427,5)","v":"11V-7"},{"$f":"IFERROR(IF(VLOOKUP(D427,#REF!,2,0)=\"O\",0,IF(VLOOKUP(D427,#REF!,2,0)=\"T\",1,0)),\"ERROR\")","v":"ERROR"},null,null,null,null,"786-6","786-6 TESC License Plate Account-Non-Appropriated",null,null,null,null,null,null,null,null,null,null,null,null,null,null,null,null,null,null,null,null,"315","02H-6","31502H-6",0]
[null,"305-Department of Veterans' Affairs","11V-9 Veteran Estate Management Account-Private/Local Unanticipated",{"$f":"LEFT(ActiveFunds!$C428,5)","v":"11V-9"},{"$f":"IFERROR(IF(VLOOKUP(D428,#REF!,2,0)=\"O\",0,IF(VLOOKUP(D428,#REF!,2,0)=\"T\",1,0)),\"ERROR\")","v":"ERROR"},null,null,null,null,"788-6","788-6 Adv College Tuition Payment Pgm-Non-Appropriated",null,null,null,null,null,null,null,null,null,null,null,null,null,null,null,null,null,null,null,null,"340","001-1","340001-1",0]
[null,"305-Department of Veterans' Affairs","213-6 Veterans' Emblem Account-Non-Appropriated",{"$f":"LEFT(ActiveFunds!$C429,5)","v":"213-6"},{"$f":"IFERROR(IF(VLOOKUP(D429,#REF!,2,0)=\"O\",0,IF(VLOOKUP(D429,#REF!,2,0)=\"T\",1,0)),\"ERROR\")","v":"ERROR"},null,null,null,null,"800-6","800-6 Institutional Welfare/Betterment-Non-Appropriated",null,null,null,null,null,null,null,null,null,null,null,null,null,null,null,null,null,null,null,null,"340","001-2","340001-2",0]
[null,"305-Department of Veterans' Affairs","526-6 Veterans' Memorial Account-Non-Appropriated",{"$f":"LEFT(ActiveFunds!$C430,5)","v":"526-6"},{"$f":"IFERROR(IF(VLOOKUP(D430,#REF!,2,0)=\"O\",0,IF(VLOOKUP(D430,#REF!,2,0)=\"T\",1,0)),\"ERROR\")","v":"ERROR"},null,null,null,null,"818-6","818-6 Youth Athletic Facility Account-Non-Appropriated",null,null,null,null,null,null,null,null,null,null,null,null,null,null,null,null,null,null,null,null,"340","001-7","340001-7",0]
[null,"305-Department of Veterans' Affairs","759-6 Miscellaneous Program Account-Non-Appropriated",{"$f":"LEFT(ActiveFunds!$C431,5)","v":"759-6"},{"$f":"IFERROR(IF(VLOOKUP(D431,#REF!,2,0)=\"O\",0,IF(VLOOKUP(D431,#REF!,2,0)=\"T\",1,0)),\"ERROR\")","v":"ERROR"},null,null,null,null,"819-6","819-6 LEOFF Retirement Plan I Acct-Non-Appropriated",null,null,null,null,null,null,null,null,null,null,null,null,null,null,null,null,null,null,null,null,"340","08A-1","34008A-1",0]
[null,"305-Department of Veterans' Affairs","800-6 Institutional Welfare/Betterment-Non-Appropriated",{"$f":"LEFT(ActiveFunds!$C432,5)","v":"800-6"},{"$f":"IFERROR(IF(VLOOKUP(D432,#REF!,2,0)=\"O\",0,IF(VLOOKUP(D432,#REF!,2,0)=\"T\",1,0)),\"ERROR\")","v":"ERROR"},null,null,null,null,"821-6","821-6 Impaired Physician Account-Non-Appropriated",null,null,null,null,null,null,null,null,null,null,null,null,null,null,null,null,null,null,null,null,"340","17F-1","34017F-1",0]
[null,"307-Dept of Children, Youth & Families","001-1 General Fund-State",{"$f":"LEFT(ActiveFunds!$C433,5)","v":"001-1"},{"$f":"IFERROR(IF(VLOOKUP(D446,#REF!,2,0)=\"O\",0,IF(VLOOKUP(D446,#REF!,2,0)=\"T\",1,0)),\"ERROR\")","v":"ERROR"},null,null,null,null,"823-6","823-6 Livestock Nutrient Management Acct-Non-Appropriated",null,null,null,null,null,null,null,null,null,null,null,null,null,null,null,null,null,null,null,null,"340","17R-1","34017R-1",0]
[null,"307-Dept of Children, Youth & Families","001-2 General Fund-Federal",{"$f":"LEFT(ActiveFunds!$C434,5)","v":"001-2"},{"$f":"IFERROR(IF(VLOOKUP(D447,#REF!,2,0)=\"O\",0,IF(VLOOKUP(D447,#REF!,2,0)=\"T\",1,0)),\"ERROR\")","v":"ERROR"},null,null,null,null,"828-1","828-1 Tobacco Prevention and Control Acct-State",null,null,null,null,null,null,null,null,null,null,null,null,null,null,null,null,null,null,null,null,"340","18H-1","34018H-1",0]
[null,"307-Dept of Children, Youth & Families","001-7 General Fund-Private/Local",{"$f":"LEFT(ActiveFunds!$C435,5)","v":"001-7"},{"$f":"IFERROR(IF(VLOOKUP(D448,#REF!,2,0)=\"O\",0,IF(VLOOKUP(D448,#REF!,2,0)=\"T\",1,0)),\"ERROR\")","v":"ERROR"},null,null,null,null,"829-6","829-6 LEOFF Retirement Plan II Acct-Non-Appropriated",null,null,null,null,null,null,null,null,null,null,null,null,null,null,null,null,null,null,null,null,"340","496-6","340496-6",0]
[null,"307-Dept of Children, Youth & Families","001-A General Fund - Fam Support",{"$f":"LEFT(ActiveFunds!$C436,5)","v":"001-A"},{"$f":"IFERROR(IF(VLOOKUP(D449,#REF!,2,0)=\"O\",0,IF(VLOOKUP(D449,#REF!,2,0)=\"T\",1,0)),\"ERROR\")","v":"ERROR"},null,null,null,null,"830-1","830-1 Agricultural Coll Trust Mgmt Acct-State",null,null,null,null,null,null,null,null,null,null,null,null,null,null,null,null,null,null,null,null,"340","747-1","340747-1",0]
[null,"307-Dept of Children, Youth & Families","001-C General Fund - Medicaid",{"$f":"LEFT(ActiveFunds!$C437,5)","v":"001-C"},{"$f":"IFERROR(IF(VLOOKUP(D450,#REF!,2,0)=\"O\",0,IF(VLOOKUP(D450,#REF!,2,0)=\"T\",1,0)),\"ERROR\")","v":"ERROR"},null,null,null,null,"833-6","833-6 Develop Disability Endowment Trust-Non-Appropriated",null,null,null,null,null,null,null,null,null,null,null,null,null,null,null,null,null,null,null,null,"340","747-6","340747-6",0]
[null,"307-Dept of Children, Youth & Families","07W-1 Domestic Violence Prevention Acct-State",{"$f":"LEFT(ActiveFunds!$C438,5)","v":"07W-1"},{"$f":"IFERROR(IF(VLOOKUP(D451,#REF!,2,0)=\"O\",0,IF(VLOOKUP(D451,#REF!,2,0)=\"T\",1,0)),\"ERROR\")","v":"ERROR"},null,null,null,null,"834-6","834-6 Capitol Furnishing Preserv Comm-Non-Appropriated",null,null,null,null,null,null,null,null,null,null,null,null,null,null,null,null,null,null,null,null,"340","785-6","340785-6",0]
[null,"307-Dept of Children, Youth & Families","08A-1 Education Legacy Trust Account-State",{"$f":"LEFT(ActiveFunds!$C439,5)","v":"08A-1"},{"$f":"IFERROR(IF(VLOOKUP(D452,#REF!,2,0)=\"O\",0,IF(VLOOKUP(D452,#REF!,2,0)=\"T\",1,0)),\"ERROR\")","v":"ERROR"},null,null,null,null,"835-6","835-6 4-Yr Student Child Care in HE Acct-Non-Appropriated",null,null,null,null,null,null,null,null,null,null,null,null,null,null,null,null,null,null,null,null,"340","788-6","340788-6",0]
[null,"307-Dept of Children, Youth & Families","133-6 Childrens' Trust Account-Non-Appropriated",{"$f":"LEFT(ActiveFunds!$C440,5)","v":"133-6"},{"$f":"IFERROR(IF(VLOOKUP(D453,#REF!,2,0)=\"O\",0,IF(VLOOKUP(D453,#REF!,2,0)=\"T\",1,0)),\"ERROR\")","v":"ERROR"},null,null,null,null,"841-6","841-6 G. Robert Ross Endowment Account-Non-Appropriated",null,null,null,null,null,null,null,null,null,null,null,null,null,null,null,null,null,null,null,null,"340","835-6","340835-6",0]
[null,"307-Dept of Children, Youth & Families","17B-1 Home Visiting Services Account-State",{"$f":"LEFT(ActiveFunds!$C441,5)","v":"17B-1"},{"$f":"IFERROR(IF(VLOOKUP(D454,#REF!,2,0)=\"O\",0,IF(VLOOKUP(D454,#REF!,2,0)=\"T\",1,0)),\"ERROR\")","v":"ERROR"},null,null,null,null,"842-6","842-6 Amer Indian Scholarship Endowment-Non-Appropriated",null,null,null,null,null,null,null,null,null,null,null,null,null,null,null,null,null,null,null,null,"341","548-6","341548-6",0]
[null,"307-Dept of Children, Youth & Families","17B-2 Home Visiting Services Account-Federal",{"$f":"LEFT(ActiveFunds!$C442,5)","v":"17B-2"},{"$f":"IFERROR(IF(VLOOKUP(D455,#REF!,2,0)=\"O\",0,IF(VLOOKUP(D455,#REF!,2,0)=\"T\",1,0)),\"ERROR\")","v":"ERROR"},null,null,null,null,"846-6","846-6 Grant-In-Aid Scholarship/Fellowship-Non-Appropriated",null,null,null,null,null,null,null,null,null,null,null,null,null,null,null,null,null,null,null,null,"350","001-1","350001-1",0]
[null,"307-Dept of Children, Youth & Families","17F-1 WA Opportunity Pathways Account-State",{"$f":"LEFT(ActiveFunds!$C443,5)","v":"17F-1"},{"$f":"IFERROR(IF(VLOOKUP(D456,#REF!,2,0)=\"O\",0,IF(VLOOKUP(D456,#REF!,2,0)=\"T\",1,0)),\"ERROR\")","v":"ERROR"},null,null,null,null,"849-6","849-6 Inst of Hi Ed-Student Loan Account-Non-Appropriated",null,null,null,null,null,null,null,null,null,null,null,null,null,null,null,null,null,null,null,null,"350","001-2","350001-2",0]
[null,"307-Dept of Children, Youth & Families","17M-6 Indivi-Based/Portable Background Ch-Non-Appropriated",{"$f":"LEFT(ActiveFunds!$C444,5)","v":"17M-6"},{"$f":"IFERROR(IF(VLOOKUP(D457,#REF!,2,0)=\"O\",0,IF(VLOOKUP(D457,#REF!,2,0)=\"T\",1,0)),\"ERROR\")","v":"ERROR"},null,null,null,null,"850-6","850-6 Inst of Hi Ed-Work Study Account-Non-Appropriated",null,null,null,null,null,null,null,null,null,null,null,null,null,null,null,null,null,null,null,null,"350","001-7","350001-7",0]
[null,"307-Dept of Children, Youth & Families","489-1 Pendsion Fund Stabilzation Account - State",{"$f":"LEFT(ActiveFunds!$C445,5)","v":"489-1"},{"$f":"IFERROR(IF(VLOOKUP(D458,#REF!,2,0)=\"O\",0,IF(VLOOKUP(D458,#REF!,2,0)=\"T\",1,0)),\"ERROR\")","v":"ERROR"},null,null,null,null,"857-6","857-6 Inst of Hi Ed-Annuity & Life Income-Non-Appropriated",null,null,null,null,null,null,null,null,null,null,null,null,null,null,null,null,null,null,null,null,"350","08A-1","35008A-1",0]
[null,"310-Department of Corrections","001-1 General Fund-State",{"$f":"LEFT(ActiveFunds!$C446,5)","v":"001-1"},{"$f":"IFERROR(IF(VLOOKUP(D459,#REF!,2,0)=\"O\",0,IF(VLOOKUP(D459,#REF!,2,0)=\"T\",1,0)),\"ERROR\")","v":"ERROR"},null,null,null,null,"859-6","859-6 Inst of Hi Ed-Endowment Local Acct-Non-Appropriated",null,null,null,null,null,null,null,null,null,null,null,null,null,null,null,null,null,null,null,null,"350","17F-1","35017F-1",0]
[null,"310-Department of Corrections","001-2 General Fund-Federal",{"$f":"LEFT(ActiveFunds!$C447,5)","v":"001-2"},{"$f":"IFERROR(IF(VLOOKUP(D460,#REF!,2,0)=\"O\",0,IF(VLOOKUP(D460,#REF!,2,0)=\"T\",1,0)),\"ERROR\")","v":"ERROR"},null,null,null,null,"860-6","860-6 Inst of Hi Ed-Long Term Loan Acct-Non-Appropriated",null,null,null,null,null,null,null,null,null,null,null,null,null,null,null,null,null,null,null,null,"350","18E-6","35018E-6",0]
[null,"310-Department of Corrections","001-3 General Fund-Federal Unanticipated",{"$f":"LEFT(ActiveFunds!$C448,5)","v":"001-3"},{"$f":"IFERROR(IF(VLOOKUP(D461,#REF!,2,0)=\"O\",0,IF(VLOOKUP(D461,#REF!,2,0)=\"T\",1,0)),\"ERROR\")","v":"ERROR"},null,null,null,null,"874-6","874-6 OASI Revolving Account-Non-Appropriated",null,null,null,null,null,null,null,null,null,null,null,null,null,null,null,null,null,null,null,null,"350","315-1","350315-1",0]
[null,"310-Department of Corrections","11K-1 Washington Auto Theft Prevention-State",{"$f":"LEFT(ActiveFunds!$C449,5)","v":"11K-1"},{"$f":"IFERROR(IF(VLOOKUP(D462,#REF!,2,0)=\"O\",0,IF(VLOOKUP(D462,#REF!,2,0)=\"T\",1,0)),\"ERROR\")","v":"ERROR"},null,null,null,null,"881-6","881-6 Supplemental Pension Account-Non-Appropriated",null,null,null,null,null,null,null,null,null,null,null,null,null,null,null,null,null,null,null,null,"350","480-6","350480-6",0]
[null,"310-Department of Corrections","141-6 Federal Seizure Account-Non-Appropriated",{"$f":"LEFT(ActiveFunds!$C450,5)","v":"141-6"},{"$f":"IFERROR(IF(VLOOKUP(D463,#REF!,2,0)=\"O\",0,IF(VLOOKUP(D463,#REF!,2,0)=\"T\",1,0)),\"ERROR\")","v":"ERROR"},null,null,null,null,"882-6","882-6 Washington Judicial Retirement Acct-Non-Appropriated",null,null,null,null,null,null,null,null,null,null,null,null,null,null,null,null,null,null,null,null,"350","536-6","350536-6",0]
[null,"310-Department of Corrections","173-1 State Toxics Control Account-State",{"$f":"LEFT(ActiveFunds!$C451,5)","v":"173-1"},{"$f":"IFERROR(IF(VLOOKUP(D464,#REF!,2,0)=\"O\",0,IF(VLOOKUP(D464,#REF!,2,0)=\"T\",1,0)),\"ERROR\")","v":"ERROR"},null,null,null,null,"883-6","883-6 Second Injury Account-Non-Appropriated",null,null,null,null,null,null,null,null,null,null,null,null,null,null,null,null,null,null,null,null,"350","553-1","350553-1",0]
[null,"310-Department of Corrections","206-6 Cost of Supervision Account-Non-Appropriated",{"$f":"LEFT(ActiveFunds!$C452,5)","v":"206-6"},{"$f":"IFERROR(IF(VLOOKUP(D465,#REF!,2,0)=\"O\",0,IF(VLOOKUP(D465,#REF!,2,0)=\"T\",1,0)),\"ERROR\")","v":"ERROR"},null,null,null,null,"884-6","884-6 Gambling Revolving Account-Non-Appropriated",null,null,null,null,null,null,null,null,null,null,null,null,null,null,null,null,null,null,null,null,"350","759-6","350759-6",0]
[null,"310-Department of Corrections","226-6 State Seizure Account-Non-Appropriated",{"$f":"LEFT(ActiveFunds!$C453,5)","v":"226-6"},{"$f":"IFERROR(IF(VLOOKUP(D466,#REF!,2,0)=\"O\",0,IF(VLOOKUP(D466,#REF!,2,0)=\"T\",1,0)),\"ERROR\")","v":"ERROR"},null,null,null,null,{"$f":"MID(K453,1,5)","v":"885-1"},"885-1 Plumbing Certificate Account-State",null,null,null,null,null,null,null,null,null,null,null,null,null,null,null,null,null,null,null,null,"351","001-1","351001-1",0]
[null,"310-Department of Corrections","401-6 Correctional Industries Account-Non-Appropriated",{"$f":"LEFT(ActiveFunds!$C454,5)","v":"401-6"},{"$f":"IFERROR(IF(VLOOKUP(D467,#REF!,2,0)=\"O\",0,IF(VLOOKUP(D467,#REF!,2,0)=\"T\",1,0)),\"ERROR\")","v":"ERROR"},null,null,null,null,{"$f":"MID(K454,1,5)","v":"887-1"},"887-1 Public Facility Const Loan Revolv-State",null,null,null,null,null,null,null,null,null,null,null,null,null,null,null,null,null,null,null,null,"351","001-7",{"$f":"AF454&AG454","v":"351001-7"},0]
[null,"310-Department of Corrections","447-6 Info Tech Invest Rev Acct-Non-Appropriated",{"$f":"LEFT(ActiveFunds!$C455,5)","v":"447-6"},{"$f":"IFERROR(IF(VLOOKUP(D468,#REF!,2,0)=\"O\",0,IF(VLOOKUP(D468,#REF!,2,0)=\"T\",1,0)),\"ERROR\")","v":"ERROR"},null,null,null,null,{"$f":"MID(K455,1,5)","v":"888-6"},"888-6 Deferred Compensation Admin Account-Non-Appropriated",null,null,null,null,null,null,null,null,null,null,null,null,null,null,null,null,null,null,null,null,"351","19B-6","35119B-6",0]
[null,"310-Department of Corrections","512-6 Institutional Stores Account-Non-Appropriated",{"$f":"LEFT(ActiveFunds!$C456,5)","v":"512-6"},{"$f":"IFERROR(IF(VLOOKUP(D469,#REF!,2,0)=\"O\",0,IF(VLOOKUP(D469,#REF!,2,0)=\"T\",1,0)),\"ERROR\")","v":"ERROR"},null,null,null,null,{"$f":"MID(K456,1,5)","v":"892-1"},"892-1 Pressure Systems Safety Account-State",null,null,null,null,null,null,null,null,null,null,null,null,null,null,null,null,null,null,null,null,"353","001-1","353001-1",0]
[null,"310-Department of Corrections","575-6 Vocational Ed Revolving-Corrections-Non-Appropriated",{"$f":"LEFT(ActiveFunds!$C457,5)","v":"575-6"},{"$f":"IFERROR(IF(VLOOKUP(D470,#REF!,2,0)=\"O\",0,IF(VLOOKUP(D470,#REF!,2,0)=\"T\",1,0)),\"ERROR\")","v":"ERROR"},null,null,null,null,{"$f":"MID(K457,1,5)","v":"492-1"},"492-1 School Employees' Insurance Admin Account",null,null,null,null,null,null,null,null,null,null,null,null,null,null,null,null,null,null,null,null,"353","19H-6","35319H-6",0]
[null,"310-Department of Corrections","759-6 Miscellaneous Program Account-Non-Appropriated",{"$f":"LEFT(ActiveFunds!$C458,5)","v":"759-6"},{"$f":"IFERROR(IF(VLOOKUP(D471,#REF!,2,0)=\"O\",0,IF(VLOOKUP(D471,#REF!,2,0)=\"T\",1,0)),\"ERROR\")","v":"ERROR"},null,null,null,null,null,null,null,null,null,null,null,null,null,null,null,null,null,null,null,null,null,null,null,null,null,null,"354","001-1","354001-1",0]
[null,"310-Department of Corrections","800-6 Institutional Welfare/Betterment-Non-Appropriated",{"$f":"LEFT(ActiveFunds!$C459,5)","v":"800-6"},{"$f":"IFERROR(IF(VLOOKUP(D472,#REF!,2,0)=\"O\",0,IF(VLOOKUP(D472,#REF!,2,0)=\"T\",1,0)),\"ERROR\")","v":"ERROR"},null,null,null,null,null,null,null,null,null,null,null,null,null,null,null,null,null,null,null,null,null,null,null,null,null,null,"354","001-2","354001-2",0]
[null,"315-Dept of Services for the Blind","001-1 General Fund-State",{"$f":"LEFT(ActiveFunds!$C460,5)","v":"001-1"},{"$f":"IFERROR(IF(VLOOKUP(D473,#REF!,2,0)=\"O\",0,IF(VLOOKUP(D473,#REF!,2,0)=\"T\",1,0)),\"ERROR\")","v":"ERROR"},null,null,null,null,null,null,null,null,null,null,null,null,null,null,null,null,null,null,null,null,null,null,null,null,null,null,"354","001-7","354001-7",0]
[null,"315-Dept of Services for the Blind","001-2 General Fund-Federal",{"$f":"LEFT(ActiveFunds!$C461,5)","v":"001-2"},{"$f":"IFERROR(IF(VLOOKUP(D474,#REF!,2,0)=\"O\",0,IF(VLOOKUP(D474,#REF!,2,0)=\"T\",1,0)),\"ERROR\")","v":"ERROR"},null,null,null,null,null,null,null,null,null,null,null,null,null,null,null,null,null,null,null,null,null,null,null,null,null,null,"354","503-6","354503-6",0]
[null,"315-Dept of Services for the Blind","001-7 General Fund-Private/Local",{"$f":"LEFT(ActiveFunds!$C462,5)","v":"001-7"},{"$f":"IFERROR(IF(VLOOKUP(D475,#REF!,2,0)=\"O\",0,IF(VLOOKUP(D475,#REF!,2,0)=\"T\",1,0)),\"ERROR\")","v":"ERROR"},null,null,null,null,null,null,null,null,null,null,null,null,null,null,null,null,null,null,null,null,null,null,null,null,null,null,"355","001-1","355001-1",0]
[null,"315-Dept of Services for the Blind","02H-6 Business Enterprises Revolving Acct-Non-Appropriated",{"$f":"LEFT(ActiveFunds!$C463,5)","v":"02H-6"},{"$f":"IFERROR(IF(VLOOKUP(D476,#REF!,2,0)=\"O\",0,IF(VLOOKUP(D476,#REF!,2,0)=\"T\",1,0)),\"ERROR\")","v":"ERROR"},null,null,null,null,null,null,null,null,null,null,null,null,null,null,null,null,null,null,null,null,null,null,null,null,null,null,"355","001-2","355001-2",0]
[null,"315-Dept of Services for the Blind","03K-6 Industrial Insurance Premium Refund-Non-Appropriated",{"$f":"LEFT(ActiveFunds!$C464,5)","v":"03K-6"},{"$f":"IFERROR(IF(VLOOKUP(D477,#REF!,2,0)=\"O\",0,IF(VLOOKUP(D477,#REF!,2,0)=\"T\",1,0)),\"ERROR\")","v":"ERROR"},null,null,null,null,null,null,null,null,null,null,null,null,null,null,null,null,null,null,null,null,null,null,null,null,null,null,"355","001-7","355001-7",0]
[null,"340-Student Achievement Council","001-1 General Fund-State",{"$f":"LEFT(ActiveFunds!$C465,5)","v":"001-1"},{"$f":"IFERROR(IF(VLOOKUP(D478,#REF!,2,0)=\"O\",0,IF(VLOOKUP(D478,#REF!,2,0)=\"T\",1,0)),\"ERROR\")","v":"ERROR"},null,null,null,null,null,null,null,null,null,null,null,null,null,null,null,null,null,null,null,null,null,null,null,null,null,null,"355","14P-6","35514P-6",0]
[null,"340-Student Achievement Council","001-2 General Fund-Federal",{"$f":"LEFT(ActiveFunds!$C466,5)","v":"001-2"},{"$f":"IFERROR(IF(VLOOKUP(D479,#REF!,2,0)=\"O\",0,IF(VLOOKUP(D479,#REF!,2,0)=\"T\",1,0)),\"ERROR\")","v":"ERROR"},null,null,null,null,null,null,null,null,null,null,null,null,null,null,null,null,null,null,null,null,null,null,null,null,null,null,"357","001-1","357001-1",0]
[null,"340-Student Achievement Council","001-7 General Fund-Private/Local",{"$f":"LEFT(ActiveFunds!$C467,5)","v":"001-7"},{"$f":"IFERROR(IF(VLOOKUP(D480,#REF!,2,0)=\"O\",0,IF(VLOOKUP(D480,#REF!,2,0)=\"T\",1,0)),\"ERROR\")","v":"ERROR"},null,null,null,null,null,null,null,null,null,null,null,null,null,null,null,null,null,null,null,null,null,null,null,null,null,null,"357","001-2","357001-2",0]
[null,"340-Student Achievement Council","03K-6 Industrial Insurance Premium Refund-Non-Appropriated",{"$f":"LEFT(ActiveFunds!$C468,5)","v":"03K-6"},{"$f":"IFERROR(IF(VLOOKUP(D481,#REF!,2,0)=\"O\",0,IF(VLOOKUP(D481,#REF!,2,0)=\"T\",1,0)),\"ERROR\")","v":"ERROR"},null,null,null,null,null,null,null,null,null,null,null,null,null,null,null,null,null,null,null,null,null,null,null,null,null,null,"357","08A-1","35708A-1",0]
[null,"340-Student Achievement Council","08A-1 Education Legacy Trust Account-State",{"$f":"LEFT(ActiveFunds!$C469,5)","v":"08A-1"},{"$f":"IFERROR(IF(VLOOKUP(D482,#REF!,2,0)=\"O\",0,IF(VLOOKUP(D482,#REF!,2,0)=\"T\",1,0)),\"ERROR\")","v":"ERROR"},null,null,null,null,null,null,null,null,null,null,null,null,null,null,null,null,null,null,null,null,null,null,null,null,null,null,"357","133-6","357133-6",0]
[null,"340-Student Achievement Council","08N-6 State Financial Aid Account-Non-Appropriated",{"$f":"LEFT(ActiveFunds!$C470,5)","v":"08N-6"},{"$f":"IFERROR(IF(VLOOKUP(D483,#REF!,2,0)=\"O\",0,IF(VLOOKUP(D483,#REF!,2,0)=\"T\",1,0)),\"ERROR\")","v":"ERROR"},null,null,null,null,null,null,null,null,null,null,null,null,null,null,null,null,null,null,null,null,null,null,null,null,null,null,"357","17B-1","35717B-1",0]
[null,"340-Student Achievement Council","17F-1 WA Opportunity Pathways Account-State",{"$f":"LEFT(ActiveFunds!$C471,5)","v":"17F-1"},{"$f":"IFERROR(IF(VLOOKUP(D484,#REF!,2,0)=\"O\",0,IF(VLOOKUP(D484,#REF!,2,0)=\"T\",1,0)),\"ERROR\")","v":"ERROR"},null,null,null,null,null,null,null,null,null,null,null,null,null,null,null,null,null,null,null,null,null,null,null,null,null,null,"357","17B-2","35717B-2",0]
[null,"340-Student Achievement Council","17R-1 Aerospace Training Student Loan Acc-State",{"$f":"LEFT(ActiveFunds!$C472,5)","v":"17R-1"},{"$f":"IFERROR(IF(VLOOKUP(D485,#REF!,2,0)=\"O\",0,IF(VLOOKUP(D485,#REF!,2,0)=\"T\",1,0)),\"ERROR\")","v":"ERROR"},null,null,null,null,null,null,null,null,null,null,null,null,null,null,null,null,null,null,null,null,null,null,null,null,null,null,"357","17F-1","35717F-1",0]
[null,"340-Student Achievement Council","17R-6 Aerospace Training Student Loan Acc-Non-Appropriated",{"$f":"LEFT(ActiveFunds!$C473,5)","v":"17R-6"},{"$f":"IFERROR(IF(VLOOKUP(D486,#REF!,2,0)=\"O\",0,IF(VLOOKUP(D486,#REF!,2,0)=\"T\",1,0)),\"ERROR\")","v":"ERROR"},null,null,null,null,null,null,null,null,null,null,null,null,null,null,null,null,null,null,null,null,null,null,null,null,null,null,"357","17M-6","35717M-6",0]
[null,"340-Student Achievement Council","18G-6 Opportunity Scholarship Match Trans-Non-Appropriated",{"$f":"LEFT(ActiveFunds!$C474,5)","v":"18G-6"},{"$f":"IFERROR(IF(VLOOKUP(D487,#REF!,2,0)=\"O\",0,IF(VLOOKUP(D487,#REF!,2,0)=\"T\",1,0)),\"ERROR\")","v":"ERROR"},null,null,null,null,null,null,null,null,null,null,null,null,null,null,null,null,null,null,null,null,null,null,null,null,null,null,"359","001-1","359001-1",0]
[null,"340-Student Achievement Council","18H-1 Opportunity Expansion Account-State",{"$f":"LEFT(ActiveFunds!$C475,5)","v":"18H-1"},{"$f":"IFERROR(IF(VLOOKUP(D488,#REF!,2,0)=\"O\",0,IF(VLOOKUP(D488,#REF!,2,0)=\"T\",1,0)),\"ERROR\")","v":"ERROR"},null,null,null,null,null,null,null,null,null,null,null,null,null,null,null,null,null,null,null,null,null,null,null,null,null,null,"359","17F-1","35917F-1",0]
[null,"340-Student Achievement Council","496-6 Future Teachers Condtnl Scholarship-Non-Appropriated",{"$f":"LEFT(ActiveFunds!$C476,5)","v":"496-6"},{"$f":"IFERROR(IF(VLOOKUP(D489,#REF!,2,0)=\"O\",0,IF(VLOOKUP(D489,#REF!,2,0)=\"T\",1,0)),\"ERROR\")","v":"ERROR"},null,null,null,null,null,null,null,null,null,null,null,null,null,null,null,null,null,null,null,null,null,null,null,null,null,null,"359","19L-1","35919L-1",0]
[null,"340-Student Achievement Council","747-1 Health Prof Loan Repay/Scholar Prog-State",{"$f":"LEFT(ActiveFunds!$C477,5)","v":"747-1"},{"$f":"IFERROR(IF(VLOOKUP(D490,#REF!,2,0)=\"O\",0,IF(VLOOKUP(D490,#REF!,2,0)=\"T\",1,0)),\"ERROR\")","v":"ERROR"},null,null,null,null,null,null,null,null,null,null,null,null,null,null,null,null,null,null,null,null,null,null,null,null,null,null,"360","001-1","360001-1",0]
[null,"340-Student Achievement Council","747-6 Health Prof Loan Repay/Scholar Prog-Non-Appropriated",{"$f":"LEFT(ActiveFunds!$C478,5)","v":"747-6"},{"$f":"IFERROR(IF(VLOOKUP(D491,#REF!,2,0)=\"O\",0,IF(VLOOKUP(D491,#REF!,2,0)=\"T\",1,0)),\"ERROR\")","v":"ERROR"},null,null,null,null,null,null,null,null,null,null,null,null,null,null,null,null,null,null,null,null,null,null,null,null,null,null,"360","02R-1","36002R-1",0]
[null,"340-Student Achievement Council","785-6 State Educational Trust Fund Acct-Non-Appropriated",{"$f":"LEFT(ActiveFunds!$C479,5)","v":"785-6"},{"$f":"IFERROR(IF(VLOOKUP(D492,#REF!,2,0)=\"O\",0,IF(VLOOKUP(D492,#REF!,2,0)=\"T\",1,0)),\"ERROR\")","v":"ERROR"},null,null,null,null,null,null,null,null,null,null,null,null,null,null,null,null,null,null,null,null,null,null,null,null,null,null,"360","08A-1","36008A-1",0]
[null,"340-Student Achievement Council","788-6 Adv College Tuition Payment Pgm-Non-Appropriated",{"$f":"LEFT(ActiveFunds!$C480,5)","v":"788-6"},{"$f":"IFERROR(IF(VLOOKUP(D493,#REF!,2,0)=\"O\",0,IF(VLOOKUP(D493,#REF!,2,0)=\"T\",1,0)),\"ERROR\")","v":"ERROR"},null,null,null,null,null,null,null,null,null,null,null,null,null,null,null,null,null,null,null,null,null,null,null,null,null,null,"360","09R-1","36009R-1",0]
[null,"340-Student Achievement Council","835-6 4-Yr Student Child Care in HE Acct-Non-Appropriated",{"$f":"LEFT(ActiveFunds!$C481,5)","v":"835-6"},{"$f":"IFERROR(IF(VLOOKUP(D494,#REF!,2,0)=\"O\",0,IF(VLOOKUP(D494,#REF!,2,0)=\"T\",1,0)),\"ERROR\")","v":"ERROR"},null,null,null,null,null,null,null,null,null,null,null,null,null,null,null,null,null,null,null,null,null,null,null,null,null,null,"360","145-6","360145-6",0]
[null,"340-Student Achievement Council","842-6 Amer Indian Scholarship Endowment-Non-Appropriated",{"$f":"LEFT(ActiveFunds!$C482,5)","v":"842-6"},{"$f":"IFERROR(IF(VLOOKUP(D495,#REF!,2,0)=\"O\",0,IF(VLOOKUP(D495,#REF!,2,0)=\"T\",1,0)),\"ERROR\")","v":"ERROR"},null,null,null,null,null,null,null,null,null,null,null,null,null,null,null,null,null,null,null,null,null,null,null,null,null,null,"360","148-6","360148-6",0]
[null,"341-LEOFF 2 Retirement Board","548-6 LEOFF Plan 2 Expense Fund-Non-Appropriated",{"$f":"LEFT(ActiveFunds!$C483,5)","v":"548-6"},{"$f":"IFERROR(IF(VLOOKUP(D496,#REF!,2,0)=\"O\",0,IF(VLOOKUP(D496,#REF!,2,0)=\"T\",1,0)),\"ERROR\")","v":"ERROR"},null,null,null,null,null,null,null,null,null,null,null,null,null,null,null,null,null,null,null,null,null,null,null,null,null,null,"360","149-6","360149-6",0]
[null,"350-Public Schools","001-1 General Fund-State",{"$f":"LEFT(ActiveFunds!$C484,5)","v":"001-1"},{"$f":"IFERROR(IF(VLOOKUP(D497,#REF!,2,0)=\"O\",0,IF(VLOOKUP(D497,#REF!,2,0)=\"T\",1,0)),\"ERROR\")","v":"ERROR"},null,null,null,null,null,null,null,null,null,null,null,null,null,null,null,null,null,null,null,null,null,null,null,null,null,null,"360","15M-1","36015M-1",0]
[null,"350-Public Schools","001-2 General Fund-Federal",{"$f":"LEFT(ActiveFunds!$C485,5)","v":"001-2"},{"$f":"IFERROR(IF(VLOOKUP(D498,#REF!,2,0)=\"O\",0,IF(VLOOKUP(D498,#REF!,2,0)=\"T\",1,0)),\"ERROR\")","v":"ERROR"},null,null,null,null,null,null,null,null,null,null,null,null,null,null,null,null,null,null,null,null,null,null,null,null,null,null,"360","315-1","360315-1",0]
[null,"350-Public Schools","001-7 General Fund-Private/Local",{"$f":"LEFT(ActiveFunds!$C486,5)","v":"001-7"},{"$f":"IFERROR(IF(VLOOKUP(D499,#REF!,2,0)=\"O\",0,IF(VLOOKUP(D499,#REF!,2,0)=\"T\",1,0)),\"ERROR\")","v":"ERROR"},null,null,null,null,null,null,null,null,null,null,null,null,null,null,null,null,null,null,null,null,null,null,null,null,null,null,"360","505-6","360505-6",0]
[null,"350-Public Schools","08A-1 Education Legacy Trust Account-State",{"$f":"LEFT(ActiveFunds!$C487,5)","v":"08A-1"},{"$f":"IFERROR(IF(VLOOKUP(D500,#REF!,2,0)=\"O\",0,IF(VLOOKUP(D500,#REF!,2,0)=\"T\",1,0)),\"ERROR\")","v":"ERROR"},null,null,null,null,null,null,null,null,null,null,null,null,null,null,null,null,null,null,null,null,null,null,null,null,null,null,"360","608-1","360608-1",0]
[null,"350-Public Schools","17F-1 WA Opportunity Pathways Account-State",{"$f":"LEFT(ActiveFunds!$C488,5)","v":"17F-1"},{"$f":"IFERROR(IF(VLOOKUP(D501,#REF!,2,0)=\"O\",0,IF(VLOOKUP(D501,#REF!,2,0)=\"T\",1,0)),\"ERROR\")","v":"ERROR"},null,null,null,null,null,null,null,null,null,null,null,null,null,null,null,null,null,null,null,null,null,null,null,null,null,null,"360","609-1","360609-1",0]
[null,"350-Public Schools","18E-6 Educator Certification Proccessing-Non-Appropriated",{"$f":"LEFT(ActiveFunds!$C489,5)","v":"18E-6"},{"$f":"IFERROR(IF(VLOOKUP(D502,#REF!,2,0)=\"O\",0,IF(VLOOKUP(D502,#REF!,2,0)=\"T\",1,0)),\"ERROR\")","v":"ERROR"},null,null,null,null,null,null,null,null,null,null,null,null,null,null,null,null,null,null,null,null,null,null,null,null,null,null,"365","001-1","365001-1",0]
[null,"350-Public Schools","315-1 Dedicated Marijuana Account-State",{"$f":"LEFT(ActiveFunds!$C490,5)","v":"315-1"},{"$f":"IFERROR(IF(VLOOKUP(D503,#REF!,2,0)=\"O\",0,IF(VLOOKUP(D503,#REF!,2,0)=\"T\",1,0)),\"ERROR\")","v":"ERROR"},null,null,null,null,null,null,null,null,null,null,null,null,null,null,null,null,null,null,null,null,null,null,null,null,null,null,"365","08A-1","36508A-1",0]
[null,"350-Public Schools","416-6 Surplus/Donated Food Commod Revolv-Non-Appropriated",{"$f":"LEFT(ActiveFunds!$C491,5)","v":"416-6"},{"$f":"IFERROR(IF(VLOOKUP(D504,#REF!,2,0)=\"O\",0,IF(VLOOKUP(D504,#REF!,2,0)=\"T\",1,0)),\"ERROR\")","v":"ERROR"},null,null,null,null,null,null,null,null,null,null,null,null,null,null,null,null,null,null,null,null,null,null,null,null,null,null,"365","143-6","365143-6",0]
[null,"350-Public Schools","480-6 Financial Education Public-Private-Non-Appropriated",{"$f":"LEFT(ActiveFunds!$C492,5)","v":"480-6"},{"$f":"IFERROR(IF(VLOOKUP(D505,#REF!,2,0)=\"O\",0,IF(VLOOKUP(D505,#REF!,2,0)=\"T\",1,0)),\"ERROR\")","v":"ERROR"},null,null,null,null,null,null,null,null,null,null,null,null,null,null,null,null,null,null,null,null,null,null,null,null,null,null,"365","145-6","365145-6",0]
[null,"350-Public Schools","536-6 Federal Food Service Revolving Acct-Non-Appropriated",{"$f":"LEFT(ActiveFunds!$C493,5)","v":"536-6"},{"$f":"IFERROR(IF(VLOOKUP(D506,#REF!,2,0)=\"O\",0,IF(VLOOKUP(D506,#REF!,2,0)=\"T\",1,0)),\"ERROR\")","v":"ERROR"},null,null,null,null,null,null,null,null,null,null,null,null,null,null,null,null,null,null,null,null,null,null,null,null,null,null,"365","148-6","365148-6",0]
[null,"350-Public Schools","553-1 Performance Audits of Govt Acct-State",{"$f":"LEFT(ActiveFunds!$C494,5)","v":"553-1"},{"$f":"IFERROR(IF(VLOOKUP(D507,#REF!,2,0)=\"O\",0,IF(VLOOKUP(D507,#REF!,2,0)=\"T\",1,0)),\"ERROR\")","v":"ERROR"},null,null,null,null,null,null,null,null,null,null,null,null,null,null,null,null,null,null,null,null,null,null,null,null,null,null,"365","149-6","365149-6",0]
[null,"350-Public Schools","759-6 Miscellaneous Program Account-Non-Appropriated",{"$f":"LEFT(ActiveFunds!$C495,5)","v":"759-6"},{"$f":"IFERROR(IF(VLOOKUP(D508,#REF!,2,0)=\"O\",0,IF(VLOOKUP(D508,#REF!,2,0)=\"T\",1,0)),\"ERROR\")","v":"ERROR"},null,null,null,null,null,null,null,null,null,null,null,null,null,null,null,null,null,null,null,null,null,null,null,null,null,null,"365","315-1","365315-1",0]
[null,"351-State School for the Blind","001-1 General Fund-State",{"$f":"LEFT(ActiveFunds!$C496,5)","v":"001-1"},{"$f":"IFERROR(IF(VLOOKUP(D509,#REF!,2,0)=\"O\",0,IF(VLOOKUP(D509,#REF!,2,0)=\"T\",1,0)),\"ERROR\")","v":"ERROR"},null,null,null,null,null,null,null,null,null,null,null,null,null,null,null,null,null,null,null,null,null,null,null,null,null,null,"370","001-1","370001-1",0]
[null,"351-State School for the Blind","001-7 General Fund-Private/Local",{"$f":"LEFT(ActiveFunds!$C497,5)","v":"001-7"},{"$f":"IFERROR(IF(VLOOKUP(D510,#REF!,2,0)=\"O\",0,IF(VLOOKUP(D510,#REF!,2,0)=\"T\",1,0)),\"ERROR\")","v":"ERROR"},null,null,null,null,null,null,null,null,null,null,null,null,null,null,null,null,null,null,null,null,null,null,null,null,null,null,"370","08A-1","37008A-1",0]
[null,"351-State School for the Blind","03K-6 Industrial Insurance Premium Refund-Non-Appropriated",{"$f":"LEFT(ActiveFunds!$C498,5)","v":"03K-6"},{"$f":"IFERROR(IF(VLOOKUP(D511,#REF!,2,0)=\"O\",0,IF(VLOOKUP(D511,#REF!,2,0)=\"T\",1,0)),\"ERROR\")","v":"ERROR"},null,null,null,null,null,null,null,null,null,null,null,null,null,null,null,null,null,null,null,null,null,null,null,null,null,null,"370","145-6","370145-6",0]
[null,"351-State School for the Blind","19B-6 School for the Blind Account-Non-Appropriated",{"$f":"LEFT(ActiveFunds!$C499,5)","v":"19B-6"},{"$f":"IFERROR(IF(VLOOKUP(D512,#REF!,2,0)=\"O\",0,IF(VLOOKUP(D512,#REF!,2,0)=\"T\",1,0)),\"ERROR\")","v":"ERROR"},null,null,null,null,null,null,null,null,null,null,null,null,null,null,null,null,null,null,null,null,null,null,null,null,null,null,"370","148-6","370148-6",0]
[null,"351-State School for the Blind","508-6 Miscellaneous Enterprise Activities-Non-Appropriated",{"$f":"LEFT(ActiveFunds!$C500,5)","v":"508-6"},{"$f":"IFERROR(IF(VLOOKUP(D513,#REF!,2,0)=\"O\",0,IF(VLOOKUP(D513,#REF!,2,0)=\"T\",1,0)),\"ERROR\")","v":"ERROR"},null,null,null,null,null,null,null,null,null,null,null,null,null,null,null,null,null,null,null,null,null,null,null,null,null,null,"370","149-6","370149-6",0]
[null,"351-State School for the Blind","800-6 Institutional Welfare/Betterment-Non-Appropriated",{"$f":"LEFT(ActiveFunds!$C501,5)","v":"800-6"},{"$f":"IFERROR(IF(VLOOKUP(D514,#REF!,2,0)=\"O\",0,IF(VLOOKUP(D514,#REF!,2,0)=\"T\",1,0)),\"ERROR\")","v":"ERROR"},null,null,null,null,null,null,null,null,null,null,null,null,null,null,null,null,null,null,null,null,null,null,null,null,null,null,"375","001-1","375001-1",0]
[null,"353-Childhood Deafness & Hearing Loss","001-1 General Fund-State",{"$f":"LEFT(ActiveFunds!$C502,5)","v":"001-1"},{"$f":"IFERROR(IF(VLOOKUP(D515,#REF!,2,0)=\"O\",0,IF(VLOOKUP(D515,#REF!,2,0)=\"T\",1,0)),\"ERROR\")","v":"ERROR"},null,null,null,null,null,null,null,null,null,null,null,null,null,null,null,null,null,null,null,null,null,null,null,null,null,null,"375","08A-1","37508A-1",0]
[null,"353-Childhood Deafness & Hearing Loss","19H-6 Center for Childhood Deafness HLA-Non-Appropriated",{"$f":"LEFT(ActiveFunds!$C503,5)","v":"19H-6"},{"$f":"IFERROR(IF(VLOOKUP(D516,#REF!,2,0)=\"O\",0,IF(VLOOKUP(D516,#REF!,2,0)=\"T\",1,0)),\"ERROR\")","v":"ERROR"},null,null,null,null,null,null,null,null,null,null,null,null,null,null,null,null,null,null,null,null,null,null,null,null,null,null,"375","145-6","375145-6",0]
[null,"353-Childhood Deafness & Hearing Loss","800-6 Institutional Welfare/Betterment-Non-Appropriated",{"$f":"LEFT(ActiveFunds!$C504,5)","v":"800-6"},{"$f":"IFERROR(IF(VLOOKUP(D517,#REF!,2,0)=\"O\",0,IF(VLOOKUP(D517,#REF!,2,0)=\"T\",1,0)),\"ERROR\")","v":"ERROR"},null,null,null,null,null,null,null,null,null,null,null,null,null,null,null,null,null,null,null,null,null,null,null,null,null,null,"375","148-6","375148-6",0]
[null,"354-Workforce Trng & Educ Coord Board","001-1 General Fund-State",{"$f":"LEFT(ActiveFunds!$C505,5)","v":"001-1"},{"$f":"IFERROR(IF(VLOOKUP(D518,#REF!,2,0)=\"O\",0,IF(VLOOKUP(D518,#REF!,2,0)=\"T\",1,0)),\"ERROR\")","v":"ERROR"},null,null,null,null,null,null,null,null,null,null,null,null,null,null,null,null,null,null,null,null,null,null,null,null,null,null,"375","149-6","375149-6",0]
[null,"354-Workforce Trng & Educ Coord Board","001-2 General Fund-Federal",{"$f":"LEFT(ActiveFunds!$C506,5)","v":"001-2"},{"$f":"IFERROR(IF(VLOOKUP(D519,#REF!,2,0)=\"O\",0,IF(VLOOKUP(D519,#REF!,2,0)=\"T\",1,0)),\"ERROR\")","v":"ERROR"},null,null,null,null,null,null,null,null,null,null,null,null,null,null,null,null,null,null,null,null,null,null,null,null,null,null,"376","001-1","376001-1",0]
[null,"354-Workforce Trng & Educ Coord Board","001-7 General Fund-Private/Local",{"$f":"LEFT(ActiveFunds!$C507,5)","v":"001-7"},{"$f":"IFERROR(IF(VLOOKUP(D520,#REF!,2,0)=\"O\",0,IF(VLOOKUP(D520,#REF!,2,0)=\"T\",1,0)),\"ERROR\")","v":"ERROR"},null,null,null,null,null,null,null,null,null,null,null,null,null,null,null,null,null,null,null,null,null,null,null,null,null,null,"376","08A-1","37608A-1",0]
[null,"354-Workforce Trng & Educ Coord Board","03K-6 Industrial Insurance Premium Refund-Non-Appropriated",{"$f":"LEFT(ActiveFunds!$C508,5)","v":"03K-6"},{"$f":"IFERROR(IF(VLOOKUP(D521,#REF!,2,0)=\"O\",0,IF(VLOOKUP(D521,#REF!,2,0)=\"T\",1,0)),\"ERROR\")","v":"ERROR"},null,null,null,null,null,null,null,null,null,null,null,null,null,null,null,null,null,null,null,null,null,null,null,null,null,null,"376","145-6","376145-6",0]
[null,"354-Workforce Trng & Educ Coord Board","503-6 Tuition Recovery Trust Fund-Non-Appropriated",{"$f":"LEFT(ActiveFunds!$C509,5)","v":"503-6"},{"$f":"IFERROR(IF(VLOOKUP(D522,#REF!,2,0)=\"O\",0,IF(VLOOKUP(D522,#REF!,2,0)=\"T\",1,0)),\"ERROR\")","v":"ERROR"},null,null,null,null,null,null,null,null,null,null,null,null,null,null,null,null,null,null,null,null,null,null,null,null,null,null,"376","148-6","376148-6",0]
[null,"355-Archaeology & Historic Preservation","001-1 General Fund-State",{"$f":"LEFT(ActiveFunds!$C510,5)","v":"001-1"},{"$f":"IFERROR(IF(VLOOKUP(D523,#REF!,2,0)=\"O\",0,IF(VLOOKUP(D523,#REF!,2,0)=\"T\",1,0)),\"ERROR\")","v":"ERROR"},null,null,null,null,null,null,null,null,null,null,null,null,null,null,null,null,null,null,null,null,null,null,null,null,null,null,"376","149-6","376149-6",0]
[null,"355-Archaeology & Historic Preservation","001-2 General Fund-Federal",{"$f":"LEFT(ActiveFunds!$C511,5)","v":"001-2"},{"$f":"IFERROR(IF(VLOOKUP(D524,#REF!,2,0)=\"O\",0,IF(VLOOKUP(D524,#REF!,2,0)=\"T\",1,0)),\"ERROR\")","v":"ERROR"},null,null,null,null,null,null,null,null,null,null,null,null,null,null,null,null,null,null,null,null,null,null,null,null,null,null,"380","001-1","380001-1",0]
[null,"355-Archaeology & Historic Preservation","001-7 General Fund-Private/Local",{"$f":"LEFT(ActiveFunds!$C512,5)","v":"001-7"},{"$f":"IFERROR(IF(VLOOKUP(D525,#REF!,2,0)=\"O\",0,IF(VLOOKUP(D525,#REF!,2,0)=\"T\",1,0)),\"ERROR\")","v":"ERROR"},null,null,null,null,null,null,null,null,null,null,null,null,null,null,null,null,null,null,null,null,null,null,null,null,null,null,"380","08A-1","38008A-1",0]
[null,"355-Archaeology & Historic Preservation","001-9 General Fund-Private/Local Unanticipated",{"$f":"LEFT(ActiveFunds!$C513,5)","v":"001-9"},{"$f":"IFERROR(IF(VLOOKUP(D526,#REF!,2,0)=\"O\",0,IF(VLOOKUP(D526,#REF!,2,0)=\"T\",1,0)),\"ERROR\")","v":"ERROR"},null,null,null,null,null,null,null,null,null,null,null,null,null,null,null,null,null,null,null,null,null,null,null,null,null,null,"380","145-6","380145-6",0]
[null,"355-Archaeology & Historic Preservation","09T-6 WA Main Street Trust Fund Account-Non-Appropriated",{"$f":"LEFT(ActiveFunds!$C514,5)","v":"09T-6"},{"$f":"IFERROR(IF(VLOOKUP(D527,#REF!,2,0)=\"O\",0,IF(VLOOKUP(D527,#REF!,2,0)=\"T\",1,0)),\"ERROR\")","v":"ERROR"},null,null,null,null,null,null,null,null,null,null,null,null,null,null,null,null,null,null,null,null,null,null,null,null,null,null,"380","148-6","380148-6",0]
[null,"355-Archaeology & Historic Preservation","108-1 Motor Vehicle Account-State",{"$f":"LEFT(ActiveFunds!$C515,5)","v":"108-1"},{"$f":"IFERROR(IF(VLOOKUP(D528,#REF!,2,0)=\"O\",0,IF(VLOOKUP(D528,#REF!,2,0)=\"T\",1,0)),\"ERROR\")","v":"ERROR"},null,null,null,null,null,null,null,null,null,null,null,null,null,null,null,null,null,null,null,null,null,null,null,null,null,null,"380","149-6","380149-6",0]
[null,"355-Archaeology & Historic Preservation","14P-6 Skeletal Human Remains Assistance-Non-Appropriated",{"$f":"LEFT(ActiveFunds!$C516,5)","v":"14P-6"},{"$f":"IFERROR(IF(VLOOKUP(D529,#REF!,2,0)=\"O\",0,IF(VLOOKUP(D529,#REF!,2,0)=\"T\",1,0)),\"ERROR\")","v":"ERROR"},null,null,null,null,null,null,null,null,null,null,null,null,null,null,null,null,null,null,null,null,null,null,null,null,null,null,"387","001-1","387001-1",0]
[null,"357-Department of Early Learning","001-1 General Fund-State",{"$f":"LEFT(ActiveFunds!$C517,5)","v":"001-1"},{"$f":"IFERROR(IF(VLOOKUP(D530,#REF!,2,0)=\"O\",0,IF(VLOOKUP(D530,#REF!,2,0)=\"T\",1,0)),\"ERROR\")","v":"ERROR"},null,null,null,null,null,null,null,null,null,null,null,null,null,null,null,null,null,null,null,null,null,null,null,null,null,null,"387","001-2","387001-2",0]
[null,"357-Department of Early Learning","001-2 General Fund-Federal",{"$f":"LEFT(ActiveFunds!$C518,5)","v":"001-2"},{"$f":"IFERROR(IF(VLOOKUP(D531,#REF!,2,0)=\"O\",0,IF(VLOOKUP(D531,#REF!,2,0)=\"T\",1,0)),\"ERROR\")","v":"ERROR"},null,null,null,null,null,null,null,null,null,null,null,null,null,null,null,null,null,null,null,null,null,null,null,null,null,null,"387","001-7",{"$f":"AF518&AG518","v":"387001-7"},0]
[null,"357-Department of Early Learning","08A-1 Education Legacy Trust Account-State",{"$f":"LEFT(ActiveFunds!$C519,5)","v":"08A-1"},{"$f":"IFERROR(IF(VLOOKUP(D532,#REF!,2,0)=\"O\",0,IF(VLOOKUP(D532,#REF!,2,0)=\"T\",1,0)),\"ERROR\")","v":"ERROR"},null,null,null,null,null,null,null,null,null,null,null,null,null,null,null,null,null,null,null,null,null,null,null,null,null,null,"390","001-1","390001-1",0]
[null,"357-Department of Early Learning","133-6 Childrens' Trust Account-Non-Appropriated",{"$f":"LEFT(ActiveFunds!$C520,5)","v":"133-6"},{"$f":"IFERROR(IF(VLOOKUP(D533,#REF!,2,0)=\"O\",0,IF(VLOOKUP(D533,#REF!,2,0)=\"T\",1,0)),\"ERROR\")","v":"ERROR"},null,null,null,null,null,null,null,null,null,null,null,null,null,null,null,null,null,null,null,null,null,null,null,null,null,null,"390","184-6","390184-6",0]
[null,"357-Department of Early Learning","17B-1 Home Visiting Services Account-State",{"$f":"LEFT(ActiveFunds!$C521,5)","v":"17B-1"},{"$f":"IFERROR(IF(VLOOKUP(D534,#REF!,2,0)=\"O\",0,IF(VLOOKUP(D534,#REF!,2,0)=\"T\",1,0)),\"ERROR\")","v":"ERROR"},null,null,null,null,null,null,null,null,null,null,null,null,null,null,null,null,null,null,null,null,null,null,null,null,null,null,"395","001-1","395001-1",0]
[null,"357-Department of Early Learning","17B-2 Home Visiting Services Account-Federal",{"$f":"LEFT(ActiveFunds!$C522,5)","v":"17B-2"},{"$f":"IFERROR(IF(VLOOKUP(D535,#REF!,2,0)=\"O\",0,IF(VLOOKUP(D535,#REF!,2,0)=\"T\",1,0)),\"ERROR\")","v":"ERROR"},null,null,null,null,null,null,null,null,null,null,null,null,null,null,null,null,null,null,null,null,null,null,null,null,null,null,"395","185-6","395185-6",0]
[null,"357-Department of Early Learning","17F-1 WA Opportunity Pathways Account-State",{"$f":"LEFT(ActiveFunds!$C523,5)","v":"17F-1"},{"$f":"IFERROR(IF(VLOOKUP(D536,#REF!,2,0)=\"O\",0,IF(VLOOKUP(D536,#REF!,2,0)=\"T\",1,0)),\"ERROR\")","v":"ERROR"},null,null,null,null,null,null,null,null,null,null,null,null,null,null,null,null,null,null,null,null,null,null,null,null,null,null,"460","001-1","460001-1",0]
[null,"357-Department of Early Learning","17M-6 Indivi-Based/Portable Background Ch-Non-Appropriated",{"$f":"LEFT(ActiveFunds!$C524,5)","v":"17M-6"},{"$f":"IFERROR(IF(VLOOKUP(D537,#REF!,2,0)=\"O\",0,IF(VLOOKUP(D537,#REF!,2,0)=\"T\",1,0)),\"ERROR\")","v":"ERROR"},null,null,null,null,null,null,null,null,null,null,null,null,null,null,null,null,null,null,null,null,null,null,null,null,null,null,"460","001-2","460001-2",0]
[null,"357-Department of Early Learning","759-6 Miscellaneous Program Account-Non-Appropriated",{"$f":"LEFT(ActiveFunds!$C525,5)","v":"759-6"},{"$f":"IFERROR(IF(VLOOKUP(D538,#REF!,2,0)=\"O\",0,IF(VLOOKUP(D538,#REF!,2,0)=\"T\",1,0)),\"ERROR\")","v":"ERROR"},null,null,null,null,null,null,null,null,null,null,null,null,null,null,null,null,null,null,null,null,null,null,null,null,null,null,"460","001-7","460001-7",0]
[null,"359-Washington Charter School Comm","001-1 General Fund-State",{"$f":"LEFT(ActiveFunds!$C526,5)","v":"001-1"},{"$f":"IFERROR(IF(VLOOKUP(D539,#REF!,2,0)=\"O\",0,IF(VLOOKUP(D539,#REF!,2,0)=\"T\",1,0)),\"ERROR\")","v":"ERROR"},null,null,null,null,null,null,null,null,null,null,null,null,null,null,null,null,null,null,null,null,null,null,null,null,null,null,"461","001-1","461001-1",0]
[null,"359-Washington Charter School Comm","17F-1 WA Opportunity Pathways Account-State",{"$f":"LEFT(ActiveFunds!$C527,5)","v":"17F-1"},{"$f":"IFERROR(IF(VLOOKUP(D540,#REF!,2,0)=\"O\",0,IF(VLOOKUP(D540,#REF!,2,0)=\"T\",1,0)),\"ERROR\")","v":"ERROR"},null,null,null,null,null,null,null,null,null,null,null,null,null,null,null,null,null,null,null,null,null,null,null,null,null,null,"461","001-2","461001-2",0]
[null,"359-Washington Charter School Comm","19L-1 Charter School Oversight Account-State",{"$f":"LEFT(ActiveFunds!$C528,5)","v":"19L-1"},{"$f":"IFERROR(IF(VLOOKUP(D541,#REF!,2,0)=\"O\",0,IF(VLOOKUP(D541,#REF!,2,0)=\"T\",1,0)),\"ERROR\")","v":"ERROR"},null,null,null,null,null,null,null,null,null,null,null,null,null,null,null,null,null,null,null,null,null,null,null,null,null,null,"461","001-7","461001-7",0]
[null,"360-University of Washington","001-1 General Fund-State",{"$f":"LEFT(ActiveFunds!$C529,5)","v":"001-1"},{"$f":"IFERROR(IF(VLOOKUP(D542,#REF!,2,0)=\"O\",0,IF(VLOOKUP(D542,#REF!,2,0)=\"T\",1,0)),\"ERROR\")","v":"ERROR"},null,null,null,null,null,null,null,null,null,null,null,null,null,null,null,null,null,null,null,null,null,null,null,null,null,null,"461","027-1","461027-1",0]
[null,"360-University of Washington","02R-1 Aquatic Lands Enhancement Account-State",{"$f":"LEFT(ActiveFunds!$C530,5)","v":"02R-1"},{"$f":"IFERROR(IF(VLOOKUP(D543,#REF!,2,0)=\"O\",0,IF(VLOOKUP(D543,#REF!,2,0)=\"T\",1,0)),\"ERROR\")","v":"ERROR"},null,null,null,null,null,null,null,null,null,null,null,null,null,null,null,null,null,null,null,null,null,null,null,null,null,null,"461","02P-1","46102P-1",0]
[null,"360-University of Washington","03K-6 Industrial Insurance Premium Refund-Non-Appropriated",{"$f":"LEFT(ActiveFunds!$C531,5)","v":"03K-6"},{"$f":"IFERROR(IF(VLOOKUP(D544,#REF!,2,0)=\"O\",0,IF(VLOOKUP(D544,#REF!,2,0)=\"T\",1,0)),\"ERROR\")","v":"ERROR"},null,null,null,null,null,null,null,null,null,null,null,null,null,null,null,null,null,null,null,null,null,null,null,null,null,null,"461","032-1","461032-1",0]
[null,"360-University of Washington","08A-1 Education Legacy Trust Account-State",{"$f":"LEFT(ActiveFunds!$C532,5)","v":"08A-1"},{"$f":"IFERROR(IF(VLOOKUP(D545,#REF!,2,0)=\"O\",0,IF(VLOOKUP(D545,#REF!,2,0)=\"T\",1,0)),\"ERROR\")","v":"ERROR"},null,null,null,null,null,null,null,null,null,null,null,null,null,null,null,null,null,null,null,null,null,null,null,null,null,null,"461","044-1","461044-1",0]
[null,"360-University of Washington","09R-1 Econ Dev Strategic Reserve Account-State",{"$f":"LEFT(ActiveFunds!$C533,5)","v":"09R-1"},{"$f":"IFERROR(IF(VLOOKUP(D546,#REF!,2,0)=\"O\",0,IF(VLOOKUP(D546,#REF!,2,0)=\"T\",1,0)),\"ERROR\")","v":"ERROR"},null,null,null,null,null,null,null,null,null,null,null,null,null,null,null,null,null,null,null,null,null,null,null,null,null,null,"461","05W-1","46105W-1",0]
[null,"360-University of Washington","145-6 Inst of Hi Ed-Grants/Contracts Acct-Non-Appropriated",{"$f":"LEFT(ActiveFunds!$C534,5)","v":"145-6"},{"$f":"IFERROR(IF(VLOOKUP(D547,#REF!,2,0)=\"O\",0,IF(VLOOKUP(D547,#REF!,2,0)=\"T\",1,0)),\"ERROR\")","v":"ERROR"},null,null,null,null,null,null,null,null,null,null,null,null,null,null,null,null,null,null,null,null,null,null,null,null,null,null,"461","072-1","461072-1",0]
[null,"360-University of Washington","145-N Inst of Hi Ed-Grants/Contracts Acct-Federal Non-Approp ARRA",{"$f":"LEFT(ActiveFunds!$C535,5)","v":"145-N"},{"$f":"IFERROR(IF(VLOOKUP(D548,#REF!,2,0)=\"O\",0,IF(VLOOKUP(D548,#REF!,2,0)=\"T\",1,0)),\"ERROR\")","v":"ERROR"},null,null,null,null,null,null,null,null,null,null,null,null,null,null,null,null,null,null,null,null,null,null,null,null,null,null,"461","10A-1","46110A-1",0]
[null,"360-University of Washington","148-6 Inst of Hi Ed-Dedicated Local Acct-Non-Appropriated",{"$f":"LEFT(ActiveFunds!$C536,5)","v":"148-6"},{"$f":"IFERROR(IF(VLOOKUP(D549,#REF!,2,0)=\"O\",0,IF(VLOOKUP(D549,#REF!,2,0)=\"T\",1,0)),\"ERROR\")","v":"ERROR"},null,null,null,null,null,null,null,null,null,null,null,null,null,null,null,null,null,null,null,null,null,null,null,null,null,null,"461","10G-1","46110G-1",0]
[null,"360-University of Washington","149-6 Inst of Hi Ed-Operating Fees Acct-Non-Appropriated",{"$f":"LEFT(ActiveFunds!$C537,5)","v":"149-6"},{"$f":"IFERROR(IF(VLOOKUP(D550,#REF!,2,0)=\"O\",0,IF(VLOOKUP(D550,#REF!,2,0)=\"T\",1,0)),\"ERROR\")","v":"ERROR"},null,null,null,null,null,null,null,null,null,null,null,null,null,null,null,null,null,null,null,null,null,null,null,null,null,null,"461","116-6","461116-6",0]
[null,"360-University of Washington","15M-1 Biotoxin Account-State",{"$f":"LEFT(ActiveFunds!$C538,5)","v":"15M-1"},{"$f":"IFERROR(IF(VLOOKUP(D551,#REF!,2,0)=\"O\",0,IF(VLOOKUP(D551,#REF!,2,0)=\"T\",1,0)),\"ERROR\")","v":"ERROR"},null,null,null,null,null,null,null,null,null,null,null,null,null,null,null,null,null,null,null,null,null,null,null,null,null,null,"461","11J-6","46111J-6",0]
[null,"360-University of Washington","315-1 Dedicated Marijuana Account-State",{"$f":"LEFT(ActiveFunds!$C539,5)","v":"315-1"},{"$f":"IFERROR(IF(VLOOKUP(D552,#REF!,2,0)=\"O\",0,IF(VLOOKUP(D552,#REF!,2,0)=\"T\",1,0)),\"ERROR\")","v":"ERROR"},null,null,null,null,null,null,null,null,null,null,null,null,null,null,null,null,null,null,null,null,null,null,null,null,null,null,"461","125-1","461125-1",0]
[null,"360-University of Washington","403-6 Self-Insurance Revolving Account-Non-Appropriated",{"$f":"LEFT(ActiveFunds!$C540,5)","v":"403-6"},{"$f":"IFERROR(IF(VLOOKUP(D553,#REF!,2,0)=\"O\",0,IF(VLOOKUP(D553,#REF!,2,0)=\"T\",1,0)),\"ERROR\")","v":"ERROR"},null,null,null,null,null,null,null,null,null,null,null,null,null,null,null,null,null,null,null,null,null,null,null,null,null,null,"461","160-1","461160-1",0]
[null,"360-University of Washington","440-6 Inst of Hi Ed-Stores Account-Non-Appropriated",{"$f":"LEFT(ActiveFunds!$C541,5)","v":"440-6"},{"$f":"IFERROR(IF(VLOOKUP(D554,#REF!,2,0)=\"O\",0,IF(VLOOKUP(D554,#REF!,2,0)=\"T\",1,0)),\"ERROR\")","v":"ERROR"},null,null,null,null,null,null,null,null,null,null,null,null,null,null,null,null,null,null,null,null,null,null,null,null,null,null,"461","163-1","461163-1",0]
[null,"360-University of Washington","443-6 Inst of Hi Ed-Data Processing Acct-Non-Appropriated",{"$f":"LEFT(ActiveFunds!$C542,5)","v":"443-6"},{"$f":"IFERROR(IF(VLOOKUP(D555,#REF!,2,0)=\"O\",0,IF(VLOOKUP(D555,#REF!,2,0)=\"T\",1,0)),\"ERROR\")","v":"ERROR"},null,null,null,null,null,null,null,null,null,null,null,null,null,null,null,null,null,null,null,null,null,null,null,null,null,null,"461","16T-6","46116T-6",0]
[null,"360-University of Washington","448-6 Inst of Hi Ed-Printing Account-Non-Appropriated",{"$f":"LEFT(ActiveFunds!$C543,5)","v":"448-6"},{"$f":"IFERROR(IF(VLOOKUP(D556,#REF!,2,0)=\"O\",0,IF(VLOOKUP(D556,#REF!,2,0)=\"T\",1,0)),\"ERROR\")","v":"ERROR"},null,null,null,null,null,null,null,null,null,null,null,null,null,null,null,null,null,null,null,null,null,null,null,null,null,null,"461","16V-1","46116V-1",0]
[null,"360-University of Washington","450-6 Inst of Hi Ed-Other Facilities Acct-Non-Appropriated",{"$f":"LEFT(ActiveFunds!$C544,5)","v":"450-6"},{"$f":"IFERROR(IF(VLOOKUP(D557,#REF!,2,0)=\"O\",0,IF(VLOOKUP(D557,#REF!,2,0)=\"T\",1,0)),\"ERROR\")","v":"ERROR"},null,null,null,null,null,null,null,null,null,null,null,null,null,null,null,null,null,null,null,null,null,null,null,null,null,null,"461","173-1","461173-1",0]
[null,"360-University of Washington","457-6 Higher Ed Retirement Benefits Revol-Non-Appropriated",{"$f":"LEFT(ActiveFunds!$C545,5)","v":"457-6"},{"$f":"IFERROR(IF(VLOOKUP(D558,#REF!,2,0)=\"O\",0,IF(VLOOKUP(D558,#REF!,2,0)=\"T\",1,0)),\"ERROR\")","v":"ERROR"},null,null,null,null,null,null,null,null,null,null,null,null,null,null,null,null,null,null,null,null,null,null,null,null,null,null,"461","173-7","461173-7",0]
[null,"360-University of Washington","460-6 Inst of Hi Ed-Motor Pool Account-Non-Appropriated",{"$f":"LEFT(ActiveFunds!$C546,5)","v":"460-6"},{"$f":"IFERROR(IF(VLOOKUP(D559,#REF!,2,0)=\"O\",0,IF(VLOOKUP(D559,#REF!,2,0)=\"T\",1,0)),\"ERROR\")","v":"ERROR"},null,null,null,null,null,null,null,null,null,null,null,null,null,null,null,null,null,null,null,null,null,null,null,null,null,null,"461","174-1","461174-1",0]
[null,"360-University of Washington","505-6 University of Washington Hospital-Non-Appropriated",{"$f":"LEFT(ActiveFunds!$C547,5)","v":"505-6"},{"$f":"IFERROR(IF(VLOOKUP(D560,#REF!,2,0)=\"O\",0,IF(VLOOKUP(D560,#REF!,2,0)=\"T\",1,0)),\"ERROR\")","v":"ERROR"},null,null,null,null,null,null,null,null,null,null,null,null,null,null,null,null,null,null,null,null,null,null,null,null,null,null,"461","176-1","461176-1",0]
[null,"360-University of Washington","522-6 Inst of Hi Ed-Associated Students'-Non-Appropriated",{"$f":"LEFT(ActiveFunds!$C548,5)","v":"522-6"},{"$f":"IFERROR(IF(VLOOKUP(D561,#REF!,2,0)=\"O\",0,IF(VLOOKUP(D561,#REF!,2,0)=\"T\",1,0)),\"ERROR\")","v":"ERROR"},null,null,null,null,null,null,null,null,null,null,null,null,null,null,null,null,null,null,null,null,null,null,null,null,null,null,"461","182-1","461182-1",0]
[null,"360-University of Washington","528-6 Inst of Hi Ed-Parking Account-Non-Appropriated",{"$f":"LEFT(ActiveFunds!$C549,5)","v":"528-6"},{"$f":"IFERROR(IF(VLOOKUP(D562,#REF!,2,0)=\"O\",0,IF(VLOOKUP(D562,#REF!,2,0)=\"T\",1,0)),\"ERROR\")","v":"ERROR"},null,null,null,null,null,null,null,null,null,null,null,null,null,null,null,null,null,null,null,null,null,null,null,null,null,null,"461","199-1","461199-1",0]
[null,"360-University of Washington","570-6 Inst of Hi Ed-Other Enterprises-Non-Appropriated",{"$f":"LEFT(ActiveFunds!$C550,5)","v":"570-6"},{"$f":"IFERROR(IF(VLOOKUP(D563,#REF!,2,0)=\"O\",0,IF(VLOOKUP(D563,#REF!,2,0)=\"T\",1,0)),\"ERROR\")","v":"ERROR"},null,null,null,null,null,null,null,null,null,null,null,null,null,null,null,null,null,null,null,null,null,null,null,null,null,null,"461","19G-1","46119G-1",0]
[null,"360-University of Washington","573-6 Inst of Hi Ed-Housing & Food Acct-Non-Appropriated",{"$f":"LEFT(ActiveFunds!$C551,5)","v":"573-6"},{"$f":"IFERROR(IF(VLOOKUP(D564,#REF!,2,0)=\"O\",0,IF(VLOOKUP(D564,#REF!,2,0)=\"T\",1,0)),\"ERROR\")","v":"ERROR"},null,null,null,null,null,null,null,null,null,null,null,null,null,null,null,null,null,null,null,null,null,null,null,null,null,null,"461","207-1","461207-1",0]
[null,"360-University of Washington","608-1 Accident Account-State",{"$f":"LEFT(ActiveFunds!$C552,5)","v":"608-1"},{"$f":"IFERROR(IF(VLOOKUP(D565,#REF!,2,0)=\"O\",0,IF(VLOOKUP(D565,#REF!,2,0)=\"T\",1,0)),\"ERROR\")","v":"ERROR"},null,null,null,null,null,null,null,null,null,null,null,null,null,null,null,null,null,null,null,null,null,null,null,null,null,null,"461","20R-1","46120R-1",0]
[null,"360-University of Washington","609-1 Medical Aid Account-State",{"$f":"LEFT(ActiveFunds!$C553,5)","v":"609-1"},{"$f":"IFERROR(IF(VLOOKUP(D566,#REF!,2,0)=\"O\",0,IF(VLOOKUP(D566,#REF!,2,0)=\"T\",1,0)),\"ERROR\")","v":"ERROR"},null,null,null,null,null,null,null,null,null,null,null,null,null,null,null,null,null,null,null,null,null,null,null,null,null,null,"461","216-1","461216-1",0]
[null,"360-University of Washington","846-6 Grant-In-Aid Scholarship/Fellowship-Non-Appropriated",{"$f":"LEFT(ActiveFunds!$C554,5)","v":"846-6"},{"$f":"IFERROR(IF(VLOOKUP(D567,#REF!,2,0)=\"O\",0,IF(VLOOKUP(D567,#REF!,2,0)=\"T\",1,0)),\"ERROR\")","v":"ERROR"},null,null,null,null,null,null,null,null,null,null,null,null,null,null,null,null,null,null,null,null,null,null,null,null,null,null,"461","217-1","461217-1",0]
[null,"360-University of Washington","849-6 Inst of Hi Ed-Student Loan Account-Non-Appropriated",{"$f":"LEFT(ActiveFunds!$C555,5)","v":"849-6"},{"$f":"IFERROR(IF(VLOOKUP(D568,#REF!,2,0)=\"O\",0,IF(VLOOKUP(D568,#REF!,2,0)=\"T\",1,0)),\"ERROR\")","v":"ERROR"},null,null,null,null,null,null,null,null,null,null,null,null,null,null,null,null,null,null,null,null,null,null,null,null,null,null,"461","219-1","461219-1",0]
[null,"360-University of Washington","857-6 Inst of Hi Ed-Annuity & Life Income-Non-Appropriated",{"$f":"LEFT(ActiveFunds!$C556,5)","v":"857-6"},{"$f":"IFERROR(IF(VLOOKUP(D569,#REF!,2,0)=\"O\",0,IF(VLOOKUP(D569,#REF!,2,0)=\"T\",1,0)),\"ERROR\")","v":"ERROR"},null,null,null,null,null,null,null,null,null,null,null,null,null,null,null,null,null,null,null,null,null,null,null,null,null,null,"461","222-1","461222-1",0]
[null,"360-University of Washington","859-6 Inst of Hi Ed-Endowment Local Acct-Non-Appropriated",{"$f":"LEFT(ActiveFunds!$C557,5)","v":"859-6"},{"$f":"IFERROR(IF(VLOOKUP(D570,#REF!,2,0)=\"O\",0,IF(VLOOKUP(D570,#REF!,2,0)=\"T\",1,0)),\"ERROR\")","v":"ERROR"},null,null,null,null,null,null,null,null,null,null,null,null,null,null,null,null,null,null,null,null,null,null,null,null,null,null,"461","223-1","461223-1",0]
[null,"360-University of Washington","860-6 Inst of Hi Ed-Long Term Loan Acct-Non-Appropriated",{"$f":"LEFT(ActiveFunds!$C558,5)","v":"860-6"},{"$f":"IFERROR(IF(VLOOKUP(D571,#REF!,2,0)=\"O\",0,IF(VLOOKUP(D571,#REF!,2,0)=\"T\",1,0)),\"ERROR\")","v":"ERROR"},null,null,null,null,null,null,null,null,null,null,null,null,null,null,null,null,null,null,null,null,null,null,null,null,null,null,"461","408-6","461408-6",0]
[null,"365-Washington State University","001-1 General Fund-State",{"$f":"LEFT(ActiveFunds!$C559,5)","v":"001-1"},{"$f":"IFERROR(IF(VLOOKUP(D572,#REF!,2,0)=\"O\",0,IF(VLOOKUP(D572,#REF!,2,0)=\"T\",1,0)),\"ERROR\")","v":"ERROR"},null,null,null,null,null,null,null,null,null,null,null,null,null,null,null,null,null,null,null,null,null,null,null,null,null,null,"461","564-1","461564-1",0]
[null,"365-Washington State University","08A-1 Education Legacy Trust Account-State",{"$f":"LEFT(ActiveFunds!$C560,5)","v":"08A-1"},{"$f":"IFERROR(IF(VLOOKUP(D573,#REF!,2,0)=\"O\",0,IF(VLOOKUP(D573,#REF!,2,0)=\"T\",1,0)),\"ERROR\")","v":"ERROR"},null,null,null,null,null,null,null,null,null,null,null,null,null,null,null,null,null,null,null,null,null,null,null,null,null,null,"461","727-1","461727-1",0]
[null,"365-Washington State University","143-6 Inst of Hi Ed-Federal Approp Acct-Non-Appropriated",{"$f":"LEFT(ActiveFunds!$C561,5)","v":"143-6"},{"$f":"IFERROR(IF(VLOOKUP(D574,#REF!,2,0)=\"O\",0,IF(VLOOKUP(D574,#REF!,2,0)=\"T\",1,0)),\"ERROR\")","v":"ERROR"},null,null,null,null,null,null,null,null,null,null,null,null,null,null,null,null,null,null,null,null,null,null,null,null,null,null,"461","727-2","461727-2",0]
[null,"365-Washington State University","145-6 Inst of Hi Ed-Grants/Contracts Acct-Non-Appropriated",{"$f":"LEFT(ActiveFunds!$C562,5)","v":"145-6"},{"$f":"IFERROR(IF(VLOOKUP(D575,#REF!,2,0)=\"O\",0,IF(VLOOKUP(D575,#REF!,2,0)=\"T\",1,0)),\"ERROR\")","v":"ERROR"},null,null,null,null,null,null,null,null,null,null,null,null,null,null,null,null,null,null,null,null,null,null,null,null,null,null,"462","20T-1","46220T-1",0]
[null,"365-Washington State University","145-N Inst of Hi Ed-Grants/Contracts Acct-Federal Non-Approp ARRA",{"$f":"LEFT(ActiveFunds!$C563,5)","v":"145-N"},{"$f":"IFERROR(IF(VLOOKUP(D576,#REF!,2,0)=\"O\",0,IF(VLOOKUP(D576,#REF!,2,0)=\"T\",1,0)),\"ERROR\")","v":"ERROR"},null,null,null,null,null,null,null,null,null,null,null,null,null,null,null,null,null,null,null,null,null,null,null,null,null,null,"462","544-1","462544-1",0]
[null,"365-Washington State University","148-6 Inst of Hi Ed-Dedicated Local Acct-Non-Appropriated",{"$f":"LEFT(ActiveFunds!$C564,5)","v":"148-6"},{"$f":"IFERROR(IF(VLOOKUP(D577,#REF!,2,0)=\"O\",0,IF(VLOOKUP(D577,#REF!,2,0)=\"T\",1,0)),\"ERROR\")","v":"ERROR"},null,null,null,null,null,null,null,null,null,null,null,null,null,null,null,null,null,null,null,null,null,null,null,null,null,null,"462","545-6","462545-6",0]
[null,"365-Washington State University","149-6 Inst of Hi Ed-Operating Fees Acct-Non-Appropriated",{"$f":"LEFT(ActiveFunds!$C565,5)","v":"149-6"},{"$f":"IFERROR(IF(VLOOKUP(D578,#REF!,2,0)=\"O\",0,IF(VLOOKUP(D578,#REF!,2,0)=\"T\",1,0)),\"ERROR\")","v":"ERROR"},null,null,null,null,null,null,null,null,null,null,null,null,null,null,null,null,null,null,null,null,null,null,null,null,null,null,"465","001-1","465001-1",0]
[null,"365-Washington State University","315-1 Dedicated Marijuana Account-State",{"$f":"LEFT(ActiveFunds!$C566,5)","v":"315-1"},{"$f":"IFERROR(IF(VLOOKUP(D579,#REF!,2,0)=\"O\",0,IF(VLOOKUP(D579,#REF!,2,0)=\"T\",1,0)),\"ERROR\")","v":"ERROR"},null,null,null,null,null,null,null,null,null,null,null,null,null,null,null,null,null,null,null,null,null,null,null,null,null,null,"465","001-2","465001-2",0]
[null,"365-Washington State University","347-6 WSU Bond Retirement Account-Non-Appropriated",{"$f":"LEFT(ActiveFunds!$C567,5)","v":"347-6"},{"$f":"IFERROR(IF(VLOOKUP(D580,#REF!,2,0)=\"O\",0,IF(VLOOKUP(D580,#REF!,2,0)=\"T\",1,0)),\"ERROR\")","v":"ERROR"},null,null,null,null,null,null,null,null,null,null,null,null,null,null,null,null,null,null,null,null,null,null,null,null,null,null,"465","007-1","465007-1",0]
[null,"365-Washington State University","440-6 Inst of Hi Ed-Stores Account-Non-Appropriated",{"$f":"LEFT(ActiveFunds!$C568,5)","v":"440-6"},{"$f":"IFERROR(IF(VLOOKUP(D581,#REF!,2,0)=\"O\",0,IF(VLOOKUP(D581,#REF!,2,0)=\"T\",1,0)),\"ERROR\")","v":"ERROR"},null,null,null,null,null,null,null,null,null,null,null,null,null,null,null,null,null,null,null,null,null,null,null,null,null,null,"465","01B-1","46501B-1",0]
[null,"365-Washington State University","448-6 Inst of Hi Ed-Printing Account-Non-Appropriated",{"$f":"LEFT(ActiveFunds!$C569,5)","v":"448-6"},{"$f":"IFERROR(IF(VLOOKUP(D582,#REF!,2,0)=\"O\",0,IF(VLOOKUP(D582,#REF!,2,0)=\"T\",1,0)),\"ERROR\")","v":"ERROR"},null,null,null,null,null,null,null,null,null,null,null,null,null,null,null,null,null,null,null,null,null,null,null,null,null,null,"465","01M-1","46501M-1",0]
[null,"365-Washington State University","450-6 Inst of Hi Ed-Other Facilities Acct-Non-Appropriated",{"$f":"LEFT(ActiveFunds!$C570,5)","v":"450-6"},{"$f":"IFERROR(IF(VLOOKUP(D583,#REF!,2,0)=\"O\",0,IF(VLOOKUP(D583,#REF!,2,0)=\"T\",1,0)),\"ERROR\")","v":"ERROR"},null,null,null,null,null,null,null,null,null,null,null,null,null,null,null,null,null,null,null,null,null,null,null,null,null,null,"465","02R-1","46502R-1",0]
[null,"365-Washington State University","460-6 Inst of Hi Ed-Motor Pool Account-Non-Appropriated",{"$f":"LEFT(ActiveFunds!$C571,5)","v":"460-6"},{"$f":"IFERROR(IF(VLOOKUP(D584,#REF!,2,0)=\"O\",0,IF(VLOOKUP(D584,#REF!,2,0)=\"T\",1,0)),\"ERROR\")","v":"ERROR"},null,null,null,null,null,null,null,null,null,null,null,null,null,null,null,null,null,null,null,null,null,null,null,null,null,null,"465","08P-6","46508P-6",0]
[null,"365-Washington State University","522-6 Inst of Hi Ed-Associated Students'-Non-Appropriated",{"$f":"LEFT(ActiveFunds!$C572,5)","v":"522-6"},{"$f":"IFERROR(IF(VLOOKUP(D585,#REF!,2,0)=\"O\",0,IF(VLOOKUP(D585,#REF!,2,0)=\"T\",1,0)),\"ERROR\")","v":"ERROR"},null,null,null,null,null,null,null,null,null,null,null,null,null,null,null,null,null,null,null,null,null,null,null,null,null,null,"465","09B-6","46509B-6",0]
[null,"365-Washington State University","528-6 Inst of Hi Ed-Parking Account-Non-Appropriated",{"$f":"LEFT(ActiveFunds!$C573,5)","v":"528-6"},{"$f":"IFERROR(IF(VLOOKUP(D586,#REF!,2,0)=\"O\",0,IF(VLOOKUP(D586,#REF!,2,0)=\"T\",1,0)),\"ERROR\")","v":"ERROR"},null,null,null,null,null,null,null,null,null,null,null,null,null,null,null,null,null,null,null,null,null,null,null,null,null,null,"465","159-6","465159-6",0]
[null,"365-Washington State University","570-6 Inst of Hi Ed-Other Enterprises-Non-Appropriated",{"$f":"LEFT(ActiveFunds!$C574,5)","v":"570-6"},{"$f":"IFERROR(IF(VLOOKUP(D587,#REF!,2,0)=\"O\",0,IF(VLOOKUP(D587,#REF!,2,0)=\"T\",1,0)),\"ERROR\")","v":"ERROR"},null,null,null,null,null,null,null,null,null,null,null,null,null,null,null,null,null,null,null,null,null,null,null,null,null,null,"465","237-1","465237-1",0]
[null,"365-Washington State University","573-6 Inst of Hi Ed-Housing & Food Acct-Non-Appropriated",{"$f":"LEFT(ActiveFunds!$C575,5)","v":"573-6"},{"$f":"IFERROR(IF(VLOOKUP(D588,#REF!,2,0)=\"O\",0,IF(VLOOKUP(D588,#REF!,2,0)=\"T\",1,0)),\"ERROR\")","v":"ERROR"},null,null,null,null,null,null,null,null,null,null,null,null,null,null,null,null,null,null,null,null,null,null,null,null,null,null,"465","269-1","465269-1",0]
[null,"365-Washington State University","776-6 WSU License Plate Account-Non-Appropriated",{"$f":"LEFT(ActiveFunds!$C576,5)","v":"776-6"},{"$f":"IFERROR(IF(VLOOKUP(D589,#REF!,2,0)=\"O\",0,IF(VLOOKUP(D589,#REF!,2,0)=\"T\",1,0)),\"ERROR\")","v":"ERROR"},null,null,null,null,null,null,null,null,null,null,null,null,null,null,null,null,null,null,null,null,null,null,null,null,null,null,"465","269-7","465269-7",0]
[null,"365-Washington State University","846-6 Grant-In-Aid Scholarship/Fellowship-Non-Appropriated",{"$f":"LEFT(ActiveFunds!$C577,5)","v":"846-6"},{"$f":"IFERROR(IF(VLOOKUP(D590,#REF!,2,0)=\"O\",0,IF(VLOOKUP(D590,#REF!,2,0)=\"T\",1,0)),\"ERROR\")","v":"ERROR"},null,null,null,null,null,null,null,null,null,null,null,null,null,null,null,null,null,null,null,null,null,null,null,null,null,null,"467","001-1","467001-1",0]
[null,"365-Washington State University","849-6 Inst of Hi Ed-Student Loan Account-Non-Appropriated",{"$f":"LEFT(ActiveFunds!$C578,5)","v":"849-6"},{"$f":"IFERROR(IF(VLOOKUP(D591,#REF!,2,0)=\"O\",0,IF(VLOOKUP(D591,#REF!,2,0)=\"T\",1,0)),\"ERROR\")","v":"ERROR"},null,null,null,null,null,null,null,null,null,null,null,null,null,null,null,null,null,null,null,null,null,null,null,null,null,null,"467","001-2","467001-2",0]
[null,"370-Eastern Washington University","001-1 General Fund-State",{"$f":"LEFT(ActiveFunds!$C579,5)","v":"001-1"},{"$f":"IFERROR(IF(VLOOKUP(D592,#REF!,2,0)=\"O\",0,IF(VLOOKUP(D592,#REF!,2,0)=\"T\",1,0)),\"ERROR\")","v":"ERROR"},null,null,null,null,null,null,null,null,null,null,null,null,null,null,null,null,null,null,null,null,null,null,null,null,null,null,"467","001-7","467001-7",0]
[null,"370-Eastern Washington University","08A-1 Education Legacy Trust Account-State",{"$f":"LEFT(ActiveFunds!$C580,5)","v":"08A-1"},{"$f":"IFERROR(IF(VLOOKUP(D593,#REF!,2,0)=\"O\",0,IF(VLOOKUP(D593,#REF!,2,0)=\"T\",1,0)),\"ERROR\")","v":"ERROR"},null,null,null,null,null,null,null,null,null,null,null,null,null,null,null,null,null,null,null,null,null,null,null,null,null,null,"467","02R-1","46702R-1",0]
[null,"370-Eastern Washington University","145-6 Inst of Hi Ed-Grants/Contracts Acct-Non-Appropriated",{"$f":"LEFT(ActiveFunds!$C581,5)","v":"145-6"},{"$f":"IFERROR(IF(VLOOKUP(D594,#REF!,2,0)=\"O\",0,IF(VLOOKUP(D594,#REF!,2,0)=\"T\",1,0)),\"ERROR\")","v":"ERROR"},null,null,null,null,null,null,null,null,null,null,null,null,null,null,null,null,null,null,null,null,null,null,null,null,null,null,"467","146-1","467146-1",0]
[null,"370-Eastern Washington University","148-6 Inst of Hi Ed-Dedicated Local Acct-Non-Appropriated",{"$f":"LEFT(ActiveFunds!$C582,5)","v":"148-6"},{"$f":"IFERROR(IF(VLOOKUP(D595,#REF!,2,0)=\"O\",0,IF(VLOOKUP(D595,#REF!,2,0)=\"T\",1,0)),\"ERROR\")","v":"ERROR"},null,null,null,null,null,null,null,null,null,null,null,null,null,null,null,null,null,null,null,null,null,null,null,null,null,null,"467","267-1",{"$f":"AF582&AG582","v":"467267-1"},0]
[null,"370-Eastern Washington University","149-6 Inst of Hi Ed-Operating Fees Acct-Non-Appropriated",{"$f":"LEFT(ActiveFunds!$C583,5)","v":"149-6"},{"$f":"IFERROR(IF(VLOOKUP(D596,#REF!,2,0)=\"O\",0,IF(VLOOKUP(D596,#REF!,2,0)=\"T\",1,0)),\"ERROR\")","v":"ERROR"},null,null,null,null,null,null,null,null,null,null,null,null,null,null,null,null,null,null,null,null,null,null,null,null,null,null,"467","268-1","467268-1",0]
[null,"370-Eastern Washington University","448-6 Inst of Hi Ed-Printing Account-Non-Appropriated",{"$f":"LEFT(ActiveFunds!$C584,5)","v":"448-6"},{"$f":"IFERROR(IF(VLOOKUP(D597,#REF!,2,0)=\"O\",0,IF(VLOOKUP(D597,#REF!,2,0)=\"T\",1,0)),\"ERROR\")","v":"ERROR"},null,null,null,null,null,null,null,null,null,null,null,null,null,null,null,null,null,null,null,null,null,null,null,null,null,null,"467","818-6","467818-6",0]
[null,"370-Eastern Washington University","450-6 Inst of Hi Ed-Other Facilities Acct-Non-Appropriated",{"$f":"LEFT(ActiveFunds!$C585,5)","v":"450-6"},{"$f":"IFERROR(IF(VLOOKUP(D598,#REF!,2,0)=\"O\",0,IF(VLOOKUP(D598,#REF!,2,0)=\"T\",1,0)),\"ERROR\")","v":"ERROR"},null,null,null,null,null,null,null,null,null,null,null,null,null,null,null,null,null,null,null,null,null,null,null,null,null,null,"468","001-1","468001-1",0]
[null,"370-Eastern Washington University","460-6 Inst of Hi Ed-Motor Pool Account-Non-Appropriated",{"$f":"LEFT(ActiveFunds!$C586,5)","v":"460-6"},{"$f":"IFERROR(IF(VLOOKUP(D599,#REF!,2,0)=\"O\",0,IF(VLOOKUP(D599,#REF!,2,0)=\"T\",1,0)),\"ERROR\")","v":"ERROR"},null,null,null,null,null,null,null,null,null,null,null,null,null,null,null,null,null,null,null,null,null,null,null,null,null,null,"471","001-1","471001-1",0]
[null,"370-Eastern Washington University","522-6 Inst of Hi Ed-Associated Students'-Non-Appropriated",{"$f":"LEFT(ActiveFunds!$C587,5)","v":"522-6"},{"$f":"IFERROR(IF(VLOOKUP(D600,#REF!,2,0)=\"O\",0,IF(VLOOKUP(D600,#REF!,2,0)=\"T\",1,0)),\"ERROR\")","v":"ERROR"},null,null,null,null,null,null,null,null,null,null,null,null,null,null,null,null,null,null,null,null,null,null,null,null,null,null,"471","001-2","471001-2",0]
[null,"370-Eastern Washington University","524-6 Inst of Hi Ed-Bookstore Account-Non-Appropriated",{"$f":"LEFT(ActiveFunds!$C588,5)","v":"524-6"},{"$f":"IFERROR(IF(VLOOKUP(D601,#REF!,2,0)=\"O\",0,IF(VLOOKUP(D601,#REF!,2,0)=\"T\",1,0)),\"ERROR\")","v":"ERROR"},null,null,null,null,null,null,null,null,null,null,null,null,null,null,null,null,null,null,null,null,null,null,null,null,null,null,"471","058-1","471058-1",0]
[null,"370-Eastern Washington University","528-6 Inst of Hi Ed-Parking Account-Non-Appropriated",{"$f":"LEFT(ActiveFunds!$C589,5)","v":"528-6"},{"$f":"IFERROR(IF(VLOOKUP(D602,#REF!,2,0)=\"O\",0,IF(VLOOKUP(D602,#REF!,2,0)=\"T\",1,0)),\"ERROR\")","v":"ERROR"},null,null,null,null,null,null,null,null,null,null,null,null,null,null,null,null,null,null,null,null,null,null,null,null,null,null,"471","05H-1","47105H-1",0]
[null,"370-Eastern Washington University","570-6 Inst of Hi Ed-Other Enterprises-Non-Appropriated",{"$f":"LEFT(ActiveFunds!$C590,5)","v":"570-6"},{"$f":"IFERROR(IF(VLOOKUP(D603,#REF!,2,0)=\"O\",0,IF(VLOOKUP(D603,#REF!,2,0)=\"T\",1,0)),\"ERROR\")","v":"ERROR"},null,null,null,null,null,null,null,null,null,null,null,null,null,null,null,null,null,null,null,null,null,null,null,null,null,null,"471","173-1","471173-1",0]
[null,"370-Eastern Washington University","573-6 Inst of Hi Ed-Housing & Food Acct-Non-Appropriated",{"$f":"LEFT(ActiveFunds!$C591,5)","v":"573-6"},{"$f":"IFERROR(IF(VLOOKUP(D604,#REF!,2,0)=\"O\",0,IF(VLOOKUP(D604,#REF!,2,0)=\"T\",1,0)),\"ERROR\")","v":"ERROR"},null,null,null,null,null,null,null,null,null,null,null,null,null,null,null,null,null,null,null,null,null,null,null,null,null,null,"477","001-1","477001-1",0]
[null,"370-Eastern Washington University","779-6 EWU License Plate Account-Non-Appropriated",{"$f":"LEFT(ActiveFunds!$C592,5)","v":"779-6"},{"$f":"IFERROR(IF(VLOOKUP(D605,#REF!,2,0)=\"O\",0,IF(VLOOKUP(D605,#REF!,2,0)=\"T\",1,0)),\"ERROR\")","v":"ERROR"},null,null,null,null,null,null,null,null,null,null,null,null,null,null,null,null,null,null,null,null,null,null,null,null,null,null,"477","001-2","477001-2",0]
[null,"370-Eastern Washington University","846-6 Grant-In-Aid Scholarship/Fellowship-Non-Appropriated",{"$f":"LEFT(ActiveFunds!$C593,5)","v":"846-6"},{"$f":"IFERROR(IF(VLOOKUP(D606,#REF!,2,0)=\"O\",0,IF(VLOOKUP(D606,#REF!,2,0)=\"T\",1,0)),\"ERROR\")","v":"ERROR"},null,null,null,null,null,null,null,null,null,null,null,null,null,null,null,null,null,null,null,null,null,null,null,null,null,null,"477","001-7","477001-7",0]
[null,"370-Eastern Washington University","849-6 Inst of Hi Ed-Student Loan Account-Non-Appropriated",{"$f":"LEFT(ActiveFunds!$C594,5)","v":"849-6"},{"$f":"IFERROR(IF(VLOOKUP(D607,#REF!,2,0)=\"O\",0,IF(VLOOKUP(D607,#REF!,2,0)=\"T\",1,0)),\"ERROR\")","v":"ERROR"},null,null,null,null,null,null,null,null,null,null,null,null,null,null,null,null,null,null,null,null,null,null,null,null,null,null,"477","01B-1","47701B-1",0]
[null,"375-Central Washington University","001-1 General Fund-State",{"$f":"LEFT(ActiveFunds!$C595,5)","v":"001-1"},{"$f":"IFERROR(IF(VLOOKUP(D608,#REF!,2,0)=\"O\",0,IF(VLOOKUP(D608,#REF!,2,0)=\"T\",1,0)),\"ERROR\")","v":"ERROR"},null,null,null,null,null,null,null,null,null,null,null,null,null,null,null,null,null,null,null,null,null,null,null,null,null,null,"477","02R-1","47702R-1",0]
[null,"375-Central Washington University","08A-1 Education Legacy Trust Account-State",{"$f":"LEFT(ActiveFunds!$C596,5)","v":"08A-1"},{"$f":"IFERROR(IF(VLOOKUP(D609,#REF!,2,0)=\"O\",0,IF(VLOOKUP(D609,#REF!,2,0)=\"T\",1,0)),\"ERROR\")","v":"ERROR"},null,null,null,null,null,null,null,null,null,null,null,null,null,null,null,null,null,null,null,null,null,null,null,null,null,null,"477","04M-1","47704M-1",0]
[null,"375-Central Washington University","145-6 Inst of Hi Ed-Grants/Contracts Acct-Non-Appropriated",{"$f":"LEFT(ActiveFunds!$C597,5)","v":"145-6"},{"$f":"IFERROR(IF(VLOOKUP(D610,#REF!,2,0)=\"O\",0,IF(VLOOKUP(D610,#REF!,2,0)=\"T\",1,0)),\"ERROR\")","v":"ERROR"},null,null,null,null,null,null,null,null,null,null,null,null,null,null,null,null,null,null,null,null,null,null,null,null,null,null,"477","05H-1","47705H-1",0]
[null,"375-Central Washington University","148-6 Inst of Hi Ed-Dedicated Local Acct-Non-Appropriated",{"$f":"LEFT(ActiveFunds!$C598,5)","v":"148-6"},{"$f":"IFERROR(IF(VLOOKUP(D611,#REF!,2,0)=\"O\",0,IF(VLOOKUP(D611,#REF!,2,0)=\"T\",1,0)),\"ERROR\")","v":"ERROR"},null,null,null,null,null,null,null,null,null,null,null,null,null,null,null,null,null,null,null,null,null,null,null,null,null,null,"477","071-1","477071-1",0]
[null,"375-Central Washington University","149-6 Inst of Hi Ed-Operating Fees Acct-Non-Appropriated",{"$f":"LEFT(ActiveFunds!$C599,5)","v":"149-6"},{"$f":"IFERROR(IF(VLOOKUP(D612,#REF!,2,0)=\"O\",0,IF(VLOOKUP(D612,#REF!,2,0)=\"T\",1,0)),\"ERROR\")","v":"ERROR"},null,null,null,null,null,null,null,null,null,null,null,null,null,null,null,null,null,null,null,null,null,null,null,null,null,null,"477","07V-6","47707V-6",0]
[null,"375-Central Washington University","252-6 Hi Ed Non-Proprietary Local Capital-Non-Appropriated",{"$f":"LEFT(ActiveFunds!$C600,5)","v":"252-6"},{"$f":"IFERROR(IF(VLOOKUP(D613,#REF!,2,0)=\"O\",0,IF(VLOOKUP(D613,#REF!,2,0)=\"T\",1,0)),\"ERROR\")","v":"ERROR"},null,null,null,null,null,null,null,null,null,null,null,null,null,null,null,null,null,null,null,null,null,null,null,null,null,null,"477","098-1","477098-1",0]
[null,"375-Central Washington University","440-6 Inst of Hi Ed-Stores Account-Non-Appropriated",{"$f":"LEFT(ActiveFunds!$C601,5)","v":"440-6"},{"$f":"IFERROR(IF(VLOOKUP(D614,#REF!,2,0)=\"O\",0,IF(VLOOKUP(D614,#REF!,2,0)=\"T\",1,0)),\"ERROR\")","v":"ERROR"},null,null,null,null,null,null,null,null,null,null,null,null,null,null,null,null,null,null,null,null,null,null,null,null,null,null,"477","09J-6","47709J-6",0]
[null,"375-Central Washington University","448-6 Inst of Hi Ed-Printing Account-Non-Appropriated",{"$f":"LEFT(ActiveFunds!$C602,5)","v":"448-6"},{"$f":"IFERROR(IF(VLOOKUP(D615,#REF!,2,0)=\"O\",0,IF(VLOOKUP(D615,#REF!,2,0)=\"T\",1,0)),\"ERROR\")","v":"ERROR"},null,null,null,null,null,null,null,null,null,null,null,null,null,null,null,null,null,null,null,null,null,null,null,null,null,null,"477","09M-1","47709M-1",0]
[null,"375-Central Washington University","450-6 Inst of Hi Ed-Other Facilities Acct-Non-Appropriated",{"$f":"LEFT(ActiveFunds!$C603,5)","v":"450-6"},{"$f":"IFERROR(IF(VLOOKUP(D616,#REF!,2,0)=\"O\",0,IF(VLOOKUP(D616,#REF!,2,0)=\"T\",1,0)),\"ERROR\")","v":"ERROR"},null,null,null,null,null,null,null,null,null,null,null,null,null,null,null,null,null,null,null,null,null,null,null,null,null,null,"477","09N-1","47709N-1",0]
[null,"375-Central Washington University","460-6 Inst of Hi Ed-Motor Pool Account-Non-Appropriated",{"$f":"LEFT(ActiveFunds!$C604,5)","v":"460-6"},{"$f":"IFERROR(IF(VLOOKUP(D617,#REF!,2,0)=\"O\",0,IF(VLOOKUP(D617,#REF!,2,0)=\"T\",1,0)),\"ERROR\")","v":"ERROR"},null,null,null,null,null,null,null,null,null,null,null,null,null,null,null,null,null,null,null,null,null,null,null,null,null,null,"477","104-1","477104-1",0]
[null,"375-Central Washington University","522-6 Inst of Hi Ed-Associated Students'-Non-Appropriated",{"$f":"LEFT(ActiveFunds!$C605,5)","v":"522-6"},{"$f":"IFERROR(IF(VLOOKUP(D618,#REF!,2,0)=\"O\",0,IF(VLOOKUP(D618,#REF!,2,0)=\"T\",1,0)),\"ERROR\")","v":"ERROR"},null,null,null,null,null,null,null,null,null,null,null,null,null,null,null,null,null,null,null,null,null,null,null,null,null,null,"477","110-1","477110-1",0]
[null,"375-Central Washington University","524-6 Inst of Hi Ed-Bookstore Account-Non-Appropriated",{"$f":"LEFT(ActiveFunds!$C606,5)","v":"524-6"},{"$f":"IFERROR(IF(VLOOKUP(D619,#REF!,2,0)=\"O\",0,IF(VLOOKUP(D619,#REF!,2,0)=\"T\",1,0)),\"ERROR\")","v":"ERROR"},null,null,null,null,null,null,null,null,null,null,null,null,null,null,null,null,null,null,null,null,null,null,null,null,null,null,"477","110-2","477110-2",0]
[null,"375-Central Washington University","528-6 Inst of Hi Ed-Parking Account-Non-Appropriated",{"$f":"LEFT(ActiveFunds!$C607,5)","v":"528-6"},{"$f":"IFERROR(IF(VLOOKUP(D620,#REF!,2,0)=\"O\",0,IF(VLOOKUP(D620,#REF!,2,0)=\"T\",1,0)),\"ERROR\")","v":"ERROR"},null,null,null,null,null,null,null,null,null,null,null,null,null,null,null,null,null,null,null,null,null,null,null,null,null,null,"477","110-7","477110-7",0]
[null,"375-Central Washington University","573-6 Inst of Hi Ed-Housing & Food Acct-Non-Appropriated",{"$f":"LEFT(ActiveFunds!$C608,5)","v":"573-6"},{"$f":"IFERROR(IF(VLOOKUP(D621,#REF!,2,0)=\"O\",0,IF(VLOOKUP(D621,#REF!,2,0)=\"T\",1,0)),\"ERROR\")","v":"ERROR"},null,null,null,null,null,null,null,null,null,null,null,null,null,null,null,null,null,null,null,null,null,null,null,null,null,null,"477","12G-6","47712G-6",0]
[null,"375-Central Washington University","846-6 Grant-In-Aid Scholarship/Fellowship-Non-Appropriated",{"$f":"LEFT(ActiveFunds!$C609,5)","v":"846-6"},{"$f":"IFERROR(IF(VLOOKUP(D622,#REF!,2,0)=\"O\",0,IF(VLOOKUP(D622,#REF!,2,0)=\"T\",1,0)),\"ERROR\")","v":"ERROR"},null,null,null,null,null,null,null,null,null,null,null,null,null,null,null,null,null,null,null,null,null,null,null,null,null,null,"477","14A-1","47714A-1",0]
[null,"375-Central Washington University","859-6 Inst of Hi Ed-Endowment Local Acct-Non-Appropriated",{"$f":"LEFT(ActiveFunds!$C610,5)","v":"859-6"},{"$f":"IFERROR(IF(VLOOKUP(D623,#REF!,2,0)=\"O\",0,IF(VLOOKUP(D623,#REF!,2,0)=\"T\",1,0)),\"ERROR\")","v":"ERROR"},null,null,null,null,null,null,null,null,null,null,null,null,null,null,null,null,null,null,null,null,null,null,null,null,null,null,"477","14B-1","47714B-1",0]
[null,"375-Central Washington University","860-6 Inst of Hi Ed-Long Term Loan Acct-Non-Appropriated",{"$f":"LEFT(ActiveFunds!$C611,5)","v":"860-6"},{"$f":"IFERROR(IF(VLOOKUP(D624,#REF!,2,0)=\"O\",0,IF(VLOOKUP(D624,#REF!,2,0)=\"T\",1,0)),\"ERROR\")","v":"ERROR"},null,null,null,null,null,null,null,null,null,null,null,null,null,null,null,null,null,null,null,null,null,null,null,null,null,null,"477","16H-6","47716H-6",0]
[null,"376-The Evergreen State College","001-1 General Fund-State",{"$f":"LEFT(ActiveFunds!$C612,5)","v":"001-1"},{"$f":"IFERROR(IF(VLOOKUP(D625,#REF!,2,0)=\"O\",0,IF(VLOOKUP(D625,#REF!,2,0)=\"T\",1,0)),\"ERROR\")","v":"ERROR"},null,null,null,null,null,null,null,null,null,null,null,null,null,null,null,null,null,null,null,null,null,null,null,null,null,null,"477","18L-1","47718L-1",0]
[null,"376-The Evergreen State College","08A-1 Education Legacy Trust Account-State",{"$f":"LEFT(ActiveFunds!$C613,5)","v":"08A-1"},{"$f":"IFERROR(IF(VLOOKUP(D626,#REF!,2,0)=\"O\",0,IF(VLOOKUP(D626,#REF!,2,0)=\"T\",1,0)),\"ERROR\")","v":"ERROR"},null,null,null,null,null,null,null,null,null,null,null,null,null,null,null,null,null,null,null,null,null,null,null,null,null,null,"477","19G-1","47719G-1",0]
[null,"376-The Evergreen State College","108-1 Motor Vehicle Account-State",{"$f":"LEFT(ActiveFunds!$C614,5)","v":"108-1"},{"$f":"IFERROR(IF(VLOOKUP(D627,#REF!,2,0)=\"O\",0,IF(VLOOKUP(D627,#REF!,2,0)=\"T\",1,0)),\"ERROR\")","v":"ERROR"},null,null,null,null,null,null,null,null,null,null,null,null,null,null,null,null,null,null,null,null,null,null,null,null,null,null,"477","19W-6","47719W-6",0]
[null,"376-The Evergreen State College","145-6 Inst of Hi Ed-Grants/Contracts Acct-Non-Appropriated",{"$f":"LEFT(ActiveFunds!$C615,5)","v":"145-6"},{"$f":"IFERROR(IF(VLOOKUP(D628,#REF!,2,0)=\"O\",0,IF(VLOOKUP(D628,#REF!,2,0)=\"T\",1,0)),\"ERROR\")","v":"ERROR"},null,null,null,null,null,null,null,null,null,null,null,null,null,null,null,null,null,null,null,null,null,null,null,null,null,null,"477","200-2","477200-2",0]
[null,"376-The Evergreen State College","148-6 Inst of Hi Ed-Dedicated Local Acct-Non-Appropriated",{"$f":"LEFT(ActiveFunds!$C616,5)","v":"148-6"},{"$f":"IFERROR(IF(VLOOKUP(D629,#REF!,2,0)=\"O\",0,IF(VLOOKUP(D629,#REF!,2,0)=\"T\",1,0)),\"ERROR\")","v":"ERROR"},null,null,null,null,null,null,null,null,null,null,null,null,null,null,null,null,null,null,null,null,null,null,null,null,null,null,"477","209-6","477209-6",0]
[null,"376-The Evergreen State College","149-6 Inst of Hi Ed-Operating Fees Acct-Non-Appropriated",{"$f":"LEFT(ActiveFunds!$C617,5)","v":"149-6"},{"$f":"IFERROR(IF(VLOOKUP(D630,#REF!,2,0)=\"O\",0,IF(VLOOKUP(D630,#REF!,2,0)=\"T\",1,0)),\"ERROR\")","v":"ERROR"},null,null,null,null,null,null,null,null,null,null,null,null,null,null,null,null,null,null,null,null,null,null,null,null,null,null,"477","217-1","477217-1",0]
[null,"376-The Evergreen State College","440-6 Inst of Hi Ed-Stores Account-Non-Appropriated",{"$f":"LEFT(ActiveFunds!$C618,5)","v":"440-6"},{"$f":"IFERROR(IF(VLOOKUP(D631,#REF!,2,0)=\"O\",0,IF(VLOOKUP(D631,#REF!,2,0)=\"T\",1,0)),\"ERROR\")","v":"ERROR"},null,null,null,null,null,null,null,null,null,null,null,null,null,null,null,null,null,null,null,null,null,null,null,null,null,null,"477","259-6","477259-6",0]
[null,"376-The Evergreen State College","448-6 Inst of Hi Ed-Printing Account-Non-Appropriated",{"$f":"LEFT(ActiveFunds!$C619,5)","v":"448-6"},{"$f":"IFERROR(IF(VLOOKUP(D632,#REF!,2,0)=\"O\",0,IF(VLOOKUP(D632,#REF!,2,0)=\"T\",1,0)),\"ERROR\")","v":"ERROR"},null,null,null,null,null,null,null,null,null,null,null,null,null,null,null,null,null,null,null,null,null,null,null,null,null,null,"477","320-6","477320-6",0]
[null,"376-The Evergreen State College","450-6 Inst of Hi Ed-Other Facilities Acct-Non-Appropriated",{"$f":"LEFT(ActiveFunds!$C620,5)","v":"450-6"},{"$f":"IFERROR(IF(VLOOKUP(D633,#REF!,2,0)=\"O\",0,IF(VLOOKUP(D633,#REF!,2,0)=\"T\",1,0)),\"ERROR\")","v":"ERROR"},null,null,null,null,null,null,null,null,null,null,null,null,null,null,null,null,null,null,null,null,null,null,null,null,null,null,"477","444-6","477444-6",0]
[null,"376-The Evergreen State College","460-6 Inst of Hi Ed-Motor Pool Account-Non-Appropriated",{"$f":"LEFT(ActiveFunds!$C621,5)","v":"460-6"},{"$f":"IFERROR(IF(VLOOKUP(D634,#REF!,2,0)=\"O\",0,IF(VLOOKUP(D634,#REF!,2,0)=\"T\",1,0)),\"ERROR\")","v":"ERROR"},null,null,null,null,null,null,null,null,null,null,null,null,null,null,null,null,null,null,null,null,null,null,null,null,null,null,"477","507-1","477507-1",0]
[null,"376-The Evergreen State College","522-6 Inst of Hi Ed-Associated Students'-Non-Appropriated",{"$f":"LEFT(ActiveFunds!$C622,5)","v":"522-6"},{"$f":"IFERROR(IF(VLOOKUP(D635,#REF!,2,0)=\"O\",0,IF(VLOOKUP(D635,#REF!,2,0)=\"T\",1,0)),\"ERROR\")","v":"ERROR"},null,null,null,null,null,null,null,null,null,null,null,null,null,null,null,null,null,null,null,null,null,null,null,null,null,null,"478","001-1","478001-1",0]
[null,"376-The Evergreen State College","524-6 Inst of Hi Ed-Bookstore Account-Non-Appropriated",{"$f":"LEFT(ActiveFunds!$C623,5)","v":"524-6"},{"$f":"IFERROR(IF(VLOOKUP(D636,#REF!,2,0)=\"O\",0,IF(VLOOKUP(D636,#REF!,2,0)=\"T\",1,0)),\"ERROR\")","v":"ERROR"},null,null,null,null,null,null,null,null,null,null,null,null,null,null,null,null,null,null,null,null,null,null,null,null,null,null,"478","001-2","478001-2",0]
[null,"376-The Evergreen State College","528-6 Inst of Hi Ed-Parking Account-Non-Appropriated",{"$f":"LEFT(ActiveFunds!$C624,5)","v":"528-6"},{"$f":"IFERROR(IF(VLOOKUP(D637,#REF!,2,0)=\"O\",0,IF(VLOOKUP(D637,#REF!,2,0)=\"T\",1,0)),\"ERROR\")","v":"ERROR"},null,null,null,null,null,null,null,null,null,null,null,null,null,null,null,null,null,null,null,null,null,null,null,null,null,null,"478","02R-1","47802R-1",0]
[null,"376-The Evergreen State College","573-6 Inst of Hi Ed-Housing & Food Acct-Non-Appropriated",{"$f":"LEFT(ActiveFunds!$C625,5)","v":"573-6"},{"$f":"IFERROR(IF(VLOOKUP(D638,#REF!,2,0)=\"O\",0,IF(VLOOKUP(D638,#REF!,2,0)=\"T\",1,0)),\"ERROR\")","v":"ERROR"},null,null,null,null,null,null,null,null,null,null,null,null,null,null,null,null,null,null,null,null,null,null,null,null,null,null,"478","173-1","478173-1",0]
[null,"376-The Evergreen State College","786-6 TESC License Plate Account-Non-Appropriated",{"$f":"LEFT(ActiveFunds!$C626,5)","v":"786-6"},{"$f":"IFERROR(IF(VLOOKUP(D639,#REF!,2,0)=\"O\",0,IF(VLOOKUP(D639,#REF!,2,0)=\"T\",1,0)),\"ERROR\")","v":"ERROR"},null,null,null,null,null,null,null,null,null,null,null,null,null,null,null,null,null,null,null,null,null,null,null,null,null,null,"490","001-1","490001-1",0]
[null,"376-The Evergreen State College","846-6 Grant-In-Aid Scholarship/Fellowship-Non-Appropriated",{"$f":"LEFT(ActiveFunds!$C627,5)","v":"846-6"},{"$f":"IFERROR(IF(VLOOKUP(D640,#REF!,2,0)=\"O\",0,IF(VLOOKUP(D640,#REF!,2,0)=\"T\",1,0)),\"ERROR\")","v":"ERROR"},null,null,null,null,null,null,null,null,null,null,null,null,null,null,null,null,null,null,null,null,null,null,null,null,null,null,"490","001-2","490001-2",0]
[null,"376-The Evergreen State College","859-6 Inst of Hi Ed-Endowment Local Acct-Non-Appropriated",{"$f":"LEFT(ActiveFunds!$C628,5)","v":"859-6"},{"$f":"IFERROR(IF(VLOOKUP(D641,#REF!,2,0)=\"O\",0,IF(VLOOKUP(D641,#REF!,2,0)=\"T\",1,0)),\"ERROR\")","v":"ERROR"},null,null,null,null,null,null,null,null,null,null,null,null,null,null,null,null,null,null,null,null,null,null,null,null,null,null,"490","001-7","490001-7",0]
[null,"380-Western Washington University","001-1 General Fund-State",{"$f":"LEFT(ActiveFunds!$C629,5)","v":"001-1"},{"$f":"IFERROR(IF(VLOOKUP(D642,#REF!,2,0)=\"O\",0,IF(VLOOKUP(D642,#REF!,2,0)=\"T\",1,0)),\"ERROR\")","v":"ERROR"},null,null,null,null,null,null,null,null,null,null,null,null,null,null,null,null,null,null,null,null,null,null,null,null,null,null,"490","014-1","490014-1",0]
[null,"380-Western Washington University","08A-1 Education Legacy Trust Account-State",{"$f":"LEFT(ActiveFunds!$C630,5)","v":"08A-1"},{"$f":"IFERROR(IF(VLOOKUP(D643,#REF!,2,0)=\"O\",0,IF(VLOOKUP(D643,#REF!,2,0)=\"T\",1,0)),\"ERROR\")","v":"ERROR"},null,null,null,null,null,null,null,null,null,null,null,null,null,null,null,null,null,null,null,null,null,null,null,null,null,null,"490","01B-1","49001B-1",0]
[null,"380-Western Washington University","145-6 Inst of Hi Ed-Grants/Contracts Acct-Non-Appropriated",{"$f":"LEFT(ActiveFunds!$C631,5)","v":"145-6"},{"$f":"IFERROR(IF(VLOOKUP(D644,#REF!,2,0)=\"O\",0,IF(VLOOKUP(D644,#REF!,2,0)=\"T\",1,0)),\"ERROR\")","v":"ERROR"},null,null,null,null,null,null,null,null,null,null,null,null,null,null,null,null,null,null,null,null,null,null,null,null,null,null,"490","02A-1","49002A-1",0]
[null,"380-Western Washington University","148-6 Inst of Hi Ed-Dedicated Local Acct-Non-Appropriated",{"$f":"LEFT(ActiveFunds!$C632,5)","v":"148-6"},{"$f":"IFERROR(IF(VLOOKUP(D645,#REF!,2,0)=\"O\",0,IF(VLOOKUP(D645,#REF!,2,0)=\"T\",1,0)),\"ERROR\")","v":"ERROR"},null,null,null,null,null,null,null,null,null,null,null,null,null,null,null,null,null,null,null,null,null,null,null,null,null,null,"490","02R-1","49002R-1",0]
[null,"380-Western Washington University","149-6 Inst of Hi Ed-Operating Fees Acct-Non-Appropriated",{"$f":"LEFT(ActiveFunds!$C633,5)","v":"149-6"},{"$f":"IFERROR(IF(VLOOKUP(D646,#REF!,2,0)=\"O\",0,IF(VLOOKUP(D646,#REF!,2,0)=\"T\",1,0)),\"ERROR\")","v":"ERROR"},null,null,null,null,null,null,null,null,null,null,null,null,null,null,null,null,null,null,null,null,null,null,null,null,null,null,"490","030-6","490030-6",0]
[null,"380-Western Washington University","440-6 Inst of Hi Ed-Stores Account-Non-Appropriated",{"$f":"LEFT(ActiveFunds!$C634,5)","v":"440-6"},{"$f":"IFERROR(IF(VLOOKUP(D647,#REF!,2,0)=\"O\",0,IF(VLOOKUP(D647,#REF!,2,0)=\"T\",1,0)),\"ERROR\")","v":"ERROR"},null,null,null,null,null,null,null,null,null,null,null,null,null,null,null,null,null,null,null,null,null,null,null,null,null,null,"490","041-1","490041-1",0]
[null,"380-Western Washington University","443-6 Inst of Hi Ed-Data Processing Acct-Non-Appropriated",{"$f":"LEFT(ActiveFunds!$C635,5)","v":"443-6"},{"$f":"IFERROR(IF(VLOOKUP(D648,#REF!,2,0)=\"O\",0,IF(VLOOKUP(D648,#REF!,2,0)=\"T\",1,0)),\"ERROR\")","v":"ERROR"},null,null,null,null,null,null,null,null,null,null,null,null,null,null,null,null,null,null,null,null,null,null,null,null,null,null,"490","04H-1","49004H-1",0]
[null,"380-Western Washington University","448-6 Inst of Hi Ed-Printing Account-Non-Appropriated",{"$f":"LEFT(ActiveFunds!$C636,5)","v":"448-6"},{"$f":"IFERROR(IF(VLOOKUP(D649,#REF!,2,0)=\"O\",0,IF(VLOOKUP(D649,#REF!,2,0)=\"T\",1,0)),\"ERROR\")","v":"ERROR"},null,null,null,null,null,null,null,null,null,null,null,null,null,null,null,null,null,null,null,null,null,null,null,null,null,null,"490","05H-1","49005H-1",0]
[null,"380-Western Washington University","450-6 Inst of Hi Ed-Other Facilities Acct-Non-Appropriated",{"$f":"LEFT(ActiveFunds!$C637,5)","v":"450-6"},{"$f":"IFERROR(IF(VLOOKUP(D650,#REF!,2,0)=\"O\",0,IF(VLOOKUP(D650,#REF!,2,0)=\"T\",1,0)),\"ERROR\")","v":"ERROR"},null,null,null,null,null,null,null,null,null,null,null,null,null,null,null,null,null,null,null,null,null,null,null,null,null,null,"490","07E-6","49007E-6",0]
[null,"380-Western Washington University","460-6 Inst of Hi Ed-Motor Pool Account-Non-Appropriated",{"$f":"LEFT(ActiveFunds!$C638,5)","v":"460-6"},{"$f":"IFERROR(IF(VLOOKUP(D651,#REF!,2,0)=\"O\",0,IF(VLOOKUP(D651,#REF!,2,0)=\"T\",1,0)),\"ERROR\")","v":"ERROR"},null,null,null,null,null,null,null,null,null,null,null,null,null,null,null,null,null,null,null,null,null,null,null,null,null,null,"490","087-6","490087-6",0]
[null,"380-Western Washington University","522-6 Inst of Hi Ed-Associated Students'-Non-Appropriated",{"$f":"LEFT(ActiveFunds!$C639,5)","v":"522-6"},{"$f":"IFERROR(IF(VLOOKUP(D652,#REF!,2,0)=\"O\",0,IF(VLOOKUP(D652,#REF!,2,0)=\"T\",1,0)),\"ERROR\")","v":"ERROR"},null,null,null,null,null,null,null,null,null,null,null,null,null,null,null,null,null,null,null,null,null,null,null,null,null,null,"490","11H-1","49011H-1",0]
[null,"380-Western Washington University","524-6 Inst of Hi Ed-Bookstore Account-Non-Appropriated",{"$f":"LEFT(ActiveFunds!$C640,5)","v":"524-6"},{"$f":"IFERROR(IF(VLOOKUP(D653,#REF!,2,0)=\"O\",0,IF(VLOOKUP(D653,#REF!,2,0)=\"T\",1,0)),\"ERROR\")","v":"ERROR"},null,null,null,null,null,null,null,null,null,null,null,null,null,null,null,null,null,null,null,null,null,null,null,null,null,null,"490","14B-1","49014B-1",0]
[null,"380-Western Washington University","528-6 Inst of Hi Ed-Parking Account-Non-Appropriated",{"$f":"LEFT(ActiveFunds!$C641,5)","v":"528-6"},{"$f":"IFERROR(IF(VLOOKUP(D654,#REF!,2,0)=\"O\",0,IF(VLOOKUP(D654,#REF!,2,0)=\"T\",1,0)),\"ERROR\")","v":"ERROR"},null,null,null,null,null,null,null,null,null,null,null,null,null,null,null,null,null,null,null,null,null,null,null,null,null,null,"490","158-1","490158-1",0]
[null,"380-Western Washington University","570-6 Inst of Hi Ed-Other Enterprises-Non-Appropriated",{"$f":"LEFT(ActiveFunds!$C642,5)","v":"570-6"},{"$f":"IFERROR(IF(VLOOKUP(D655,#REF!,2,0)=\"O\",0,IF(VLOOKUP(D655,#REF!,2,0)=\"T\",1,0)),\"ERROR\")","v":"ERROR"},null,null,null,null,null,null,null,null,null,null,null,null,null,null,null,null,null,null,null,null,null,null,null,null,null,null,"490","167-1","490167-1",0]
[null,"380-Western Washington University","573-6 Inst of Hi Ed-Housing & Food Acct-Non-Appropriated",{"$f":"LEFT(ActiveFunds!$C643,5)","v":"573-6"},{"$f":"IFERROR(IF(VLOOKUP(D656,#REF!,2,0)=\"O\",0,IF(VLOOKUP(D656,#REF!,2,0)=\"T\",1,0)),\"ERROR\")","v":"ERROR"},null,null,null,null,null,null,null,null,null,null,null,null,null,null,null,null,null,null,null,null,null,null,null,null,null,null,"490","16P-1","49016P-1",0]
[null,"380-Western Washington University","778-6 WWU License Plate Account-Non-Appropriated",{"$f":"LEFT(ActiveFunds!$C644,5)","v":"778-6"},{"$f":"IFERROR(IF(VLOOKUP(D657,#REF!,2,0)=\"O\",0,IF(VLOOKUP(D657,#REF!,2,0)=\"T\",1,0)),\"ERROR\")","v":"ERROR"},null,null,null,null,null,null,null,null,null,null,null,null,null,null,null,null,null,null,null,null,null,null,null,null,null,null,"490","173-1","490173-1",0]
[null,"380-Western Washington University","841-6 G. Robert Ross Endowment Account-Non-Appropriated",{"$f":"LEFT(ActiveFunds!$C645,5)","v":"841-6"},{"$f":"IFERROR(IF(VLOOKUP(D658,#REF!,2,0)=\"O\",0,IF(VLOOKUP(D658,#REF!,2,0)=\"T\",1,0)),\"ERROR\")","v":"ERROR"},null,null,null,null,null,null,null,null,null,null,null,null,null,null,null,null,null,null,null,null,null,null,null,null,null,null,"490","190-6","490190-6",0]
[null,"380-Western Washington University","846-6 Grant-In-Aid Scholarship/Fellowship-Non-Appropriated",{"$f":"LEFT(ActiveFunds!$C646,5)","v":"846-6"},{"$f":"IFERROR(IF(VLOOKUP(D659,#REF!,2,0)=\"O\",0,IF(VLOOKUP(D659,#REF!,2,0)=\"T\",1,0)),\"ERROR\")","v":"ERROR"},null,null,null,null,null,null,null,null,null,null,null,null,null,null,null,null,null,null,null,null,null,null,null,null,null,null,"490","193-6",{"$f":"AF646&AG646","v":"490193-6"},0]
[null,"380-Western Washington University","849-6 Inst of Hi Ed-Student Loan Account-Non-Appropriated",{"$f":"LEFT(ActiveFunds!$C647,5)","v":"849-6"},{"$f":"IFERROR(IF(VLOOKUP(D660,#REF!,2,0)=\"O\",0,IF(VLOOKUP(D660,#REF!,2,0)=\"T\",1,0)),\"ERROR\")","v":"ERROR"},null,null,null,null,null,null,null,null,null,null,null,null,null,null,null,null,null,null,null,null,null,null,null,null,null,null,"490","198-6","490198-6",0]
[null,"380-Western Washington University","850-6 Inst of Hi Ed-Work Study Account-Non-Appropriated",{"$f":"LEFT(ActiveFunds!$C648,5)","v":"850-6"},{"$f":"IFERROR(IF(VLOOKUP(D661,#REF!,2,0)=\"O\",0,IF(VLOOKUP(D661,#REF!,2,0)=\"T\",1,0)),\"ERROR\")","v":"ERROR"},null,null,null,null,null,null,null,null,null,null,null,null,null,null,null,null,null,null,null,null,null,null,null,null,null,null,"490","19C-1","49019C-1",0]
[null,"380-Western Washington University","859-6 Inst of Hi Ed-Endowment Local Acct-Non-Appropriated",{"$f":"LEFT(ActiveFunds!$C649,5)","v":"859-6"},{"$f":"IFERROR(IF(VLOOKUP(D662,#REF!,2,0)=\"O\",0,IF(VLOOKUP(D662,#REF!,2,0)=\"T\",1,0)),\"ERROR\")","v":"ERROR"},null,null,null,null,null,null,null,null,null,null,null,null,null,null,null,null,null,null,null,null,null,null,null,null,null,null,"490","19G-1","49019G-1",0]
[null,"380-Western Washington University","860-6 Inst of Hi Ed-Long Term Loan Acct-Non-Appropriated",{"$f":"LEFT(ActiveFunds!$C650,5)","v":"860-6"},{"$f":"IFERROR(IF(VLOOKUP(D663,#REF!,2,0)=\"O\",0,IF(VLOOKUP(D663,#REF!,2,0)=\"T\",1,0)),\"ERROR\")","v":"ERROR"},null,null,null,null,null,null,null,null,null,null,null,null,null,null,null,null,null,null,null,null,null,null,null,null,null,null,"490","216-1","490216-1",0]
[null,"387-Washington State Arts Commission","001-1 General Fund-State",{"$f":"LEFT(ActiveFunds!$C651,5)","v":"001-1"},{"$f":"IFERROR(IF(VLOOKUP(D664,#REF!,2,0)=\"O\",0,IF(VLOOKUP(D664,#REF!,2,0)=\"T\",1,0)),\"ERROR\")","v":"ERROR"},null,null,null,null,null,null,null,null,null,null,null,null,null,null,null,null,null,null,null,null,null,null,null,null,null,null,"490","268-1","490268-1",0]
[null,"387-Washington State Arts Commission","001-2 General Fund-Federal",{"$f":"LEFT(ActiveFunds!$C652,5)","v":"001-2"},{"$f":"IFERROR(IF(VLOOKUP(D665,#REF!,2,0)=\"O\",0,IF(VLOOKUP(D665,#REF!,2,0)=\"T\",1,0)),\"ERROR\")","v":"ERROR"},null,null,null,null,null,null,null,null,null,null,null,null,null,null,null,null,null,null,null,null,null,null,null,null,null,null,"490","513-1","490513-1",0]
[null,"387-Washington State Arts Commission","001-7 General Fund-Private/Local",{"$f":"LEFT(ActiveFunds!$C653,5)","v":"001-7"},{"$f":"IFERROR(IF(VLOOKUP(D666,#REF!,2,0)=\"O\",0,IF(VLOOKUP(D666,#REF!,2,0)=\"T\",1,0)),\"ERROR\")","v":"ERROR"},null,null,null,null,null,null,null,null,null,null,null,null,null,null,null,null,null,null,null,null,null,null,null,null,null,null,"490","566-1","490566-1",0]
[null,"387-Washington State Arts Commission","03K-6 Industrial Insurance Premium Refund-Non-Appropriated",{"$f":"LEFT(ActiveFunds!$C654,5)","v":"03K-6"},{"$f":"IFERROR(IF(VLOOKUP(D667,#REF!,2,0)=\"O\",0,IF(VLOOKUP(D667,#REF!,2,0)=\"T\",1,0)),\"ERROR\")","v":"ERROR"},null,null,null,null,null,null,null,null,null,null,null,null,null,null,null,null,null,null,null,null,null,null,null,null,null,null,"490","830-1","490830-1",0]
[null,"387-Washington State Arts Commission","447-6 Info Tech Invest Rev Acct-Non-Appropriated",{"$f":"LEFT(ActiveFunds!$C655,5)","v":"447-6"},{"$f":"IFERROR(IF(VLOOKUP(D668,#REF!,2,0)=\"O\",0,IF(VLOOKUP(D668,#REF!,2,0)=\"T\",1,0)),\"ERROR\")","v":"ERROR"},null,null,null,null,null,null,null,null,null,null,null,null,null,null,null,null,null,null,null,null,null,null,null,null,null,null,"495","001-1","495001-1",0]
[null,"390-Washington State Historical Society","001-1 General Fund-State",{"$f":"LEFT(ActiveFunds!$C656,5)","v":"001-1"},{"$f":"IFERROR(IF(VLOOKUP(D669,#REF!,2,0)=\"O\",0,IF(VLOOKUP(D669,#REF!,2,0)=\"T\",1,0)),\"ERROR\")","v":"ERROR"},null,null,null,null,null,null,null,null,null,null,null,null,null,null,null,null,null,null,null,null,null,null,null,null,null,null,"495","001-2","495001-2",0]
[null,"390-Washington State Historical Society","184-6 Local Museum Acct-Wa St Hist Soc-Non-Appropriated",{"$f":"LEFT(ActiveFunds!$C657,5)","v":"184-6"},{"$f":"IFERROR(IF(VLOOKUP(D670,#REF!,2,0)=\"O\",0,IF(VLOOKUP(D670,#REF!,2,0)=\"T\",1,0)),\"ERROR\")","v":"ERROR"},null,null,null,null,null,null,null,null,null,null,null,null,null,null,null,null,null,null,null,null,null,null,null,null,null,null,"495","001-7","495001-7",0]
[null,"390-Washington State Historical Society","277-6 State Agency Parking Account-Non-Appropriated",{"$f":"LEFT(ActiveFunds!$C658,5)","v":"277-6"},{"$f":"IFERROR(IF(VLOOKUP(D671,#REF!,2,0)=\"O\",0,IF(VLOOKUP(D671,#REF!,2,0)=\"T\",1,0)),\"ERROR\")","v":"ERROR"},null,null,null,null,null,null,null,null,null,null,null,null,null,null,null,null,null,null,null,null,null,null,null,null,null,null,"495","02R-1","49502R-1",0]
[null,"390-Washington State Historical Society","834-6 Capitol Furnishing Preserv Comm-Non-Appropriated",{"$f":"LEFT(ActiveFunds!$C659,5)","v":"834-6"},{"$f":"IFERROR(IF(VLOOKUP(D672,#REF!,2,0)=\"O\",0,IF(VLOOKUP(D672,#REF!,2,0)=\"T\",1,0)),\"ERROR\")","v":"ERROR"},null,null,null,null,null,null,null,null,null,null,null,null,null,null,null,null,null,null,null,null,null,null,null,null,null,null,"495","126-6","495126-6",0]
[null,"395-East Wash State Historical Society","001-1 General Fund-State",{"$f":"LEFT(ActiveFunds!$C660,5)","v":"001-1"},{"$f":"IFERROR(IF(VLOOKUP(D673,#REF!,2,0)=\"O\",0,IF(VLOOKUP(D673,#REF!,2,0)=\"T\",1,0)),\"ERROR\")","v":"ERROR"},null,null,null,null,null,null,null,null,null,null,null,null,null,null,null,null,null,null,null,null,null,null,null,null,null,null,"495","128-6","495128-6",0]
[null,"395-East Wash State Historical Society","03K-6 Industrial Insurance Premium Refund-Non-Appropriated",{"$f":"LEFT(ActiveFunds!$C661,5)","v":"03K-6"},{"$f":"IFERROR(IF(VLOOKUP(D674,#REF!,2,0)=\"O\",0,IF(VLOOKUP(D674,#REF!,2,0)=\"T\",1,0)),\"ERROR\")","v":"ERROR"},null,null,null,null,null,null,null,null,null,null,null,null,null,null,null,null,null,null,null,null,null,null,null,null,null,null,"495","131-6","495131-6",0]
[null,"395-East Wash State Historical Society","185-6 Local Museum Acct-E Wa St Hist Soc-Non-Appropriated",{"$f":"LEFT(ActiveFunds!$C662,5)","v":"185-6"},{"$f":"IFERROR(IF(VLOOKUP(D675,#REF!,2,0)=\"O\",0,IF(VLOOKUP(D675,#REF!,2,0)=\"T\",1,0)),\"ERROR\")","v":"ERROR"},null,null,null,null,null,null,null,null,null,null,null,null,null,null,null,null,null,null,null,null,null,null,null,null,null,null,"495","173-1","495173-1",0]
[null,"405-Department of Transportation","039-1 Aeronautics Account-State",{"$f":"LEFT(ActiveFunds!$C663,5)","v":"039-1"},{"$f":"IFERROR(IF(VLOOKUP(D676,#REF!,2,0)=\"O\",0,IF(VLOOKUP(D676,#REF!,2,0)=\"T\",1,0)),\"ERROR\")","v":"ERROR"},null,null,null,null,null,null,null,null,null,null,null,null,null,null,null,null,null,null,null,null,null,null,null,null,null,null,"495","176-1","495176-1",0]
[null,"405-Department of Transportation","039-2 Aeronautics Account-Federal",{"$f":"LEFT(ActiveFunds!$C664,5)","v":"039-2"},{"$f":"IFERROR(IF(VLOOKUP(D677,#REF!,2,0)=\"O\",0,IF(VLOOKUP(D677,#REF!,2,0)=\"T\",1,0)),\"ERROR\")","v":"ERROR"},null,null,null,null,null,null,null,null,null,null,null,null,null,null,null,null,null,null,null,null,null,null,null,null,null,null,"495","516-6","495516-6",0]
[null,"405-Department of Transportation","039-7 Aeronautics Account-Private/Local",{"$f":"LEFT(ActiveFunds!$C665,5)","v":"039-7"},{"$f":"IFERROR(IF(VLOOKUP(D678,#REF!,2,0)=\"O\",0,IF(VLOOKUP(D678,#REF!,2,0)=\"T\",1,0)),\"ERROR\")","v":"ERROR"},null,null,null,null,null,null,null,null,null,null,null,null,null,null,null,null,null,null,null,null,null,null,null,null,null,null,"495","823-6","495823-6",0]
[null,"405-Department of Transportation","045-1 State Vehicle Parking Account-State",{"$f":"LEFT(ActiveFunds!$C666,5)","v":"045-1"},{"$f":"IFERROR(IF(VLOOKUP(D679,#REF!,2,0)=\"O\",0,IF(VLOOKUP(D679,#REF!,2,0)=\"T\",1,0)),\"ERROR\")","v":"ERROR"},null,null,null,null,null,null,null,null,null,null,null,null,null,null,null,null,null,null,null,null,null,null,null,null,null,null,"540","001-2","540001-2",0]
[null,"405-Department of Transportation","09F-1 High-Occupancy Toll Lanes Op Acct-State",{"$f":"LEFT(ActiveFunds!$C667,5)","v":"09F-1"},{"$f":"IFERROR(IF(VLOOKUP(D680,#REF!,2,0)=\"O\",0,IF(VLOOKUP(D680,#REF!,2,0)=\"T\",1,0)),\"ERROR\")","v":"ERROR"},null,null,null,null,null,null,null,null,null,null,null,null,null,null,null,null,null,null,null,null,null,null,null,null,null,null,"540","001-7","540001-7",0]
[null,"405-Department of Transportation","09H-1 Transportation Partnership Account-State",{"$f":"LEFT(ActiveFunds!$C668,5)","v":"09H-1"},{"$f":"IFERROR(IF(VLOOKUP(D681,#REF!,2,0)=\"O\",0,IF(VLOOKUP(D681,#REF!,2,0)=\"T\",1,0)),\"ERROR\")","v":"ERROR"},null,null,null,null,null,null,null,null,null,null,null,null,null,null,null,null,null,null,null,null,null,null,null,null,null,null,"540","119-2","540119-2",0]
[null,"405-Department of Transportation","108-1 Motor Vehicle Account-State",{"$f":"LEFT(ActiveFunds!$C669,5)","v":"108-1"},{"$f":"IFERROR(IF(VLOOKUP(D682,#REF!,2,0)=\"O\",0,IF(VLOOKUP(D682,#REF!,2,0)=\"T\",1,0)),\"ERROR\")","v":"ERROR"},null,null,null,null,null,null,null,null,null,null,null,null,null,null,null,null,null,null,null,null,null,null,null,null,null,null,"540","120-1","540120-1",0]
[null,"405-Department of Transportation","108-2 Motor Vehicle Account-Federal",{"$f":"LEFT(ActiveFunds!$C670,5)","v":"108-2"},{"$f":"IFERROR(IF(VLOOKUP(D683,#REF!,2,0)=\"O\",0,IF(VLOOKUP(D683,#REF!,2,0)=\"T\",1,0)),\"ERROR\")","v":"ERROR"},null,null,null,null,null,null,null,null,null,null,null,null,null,null,null,null,null,null,null,null,null,null,null,null,null,null,"540","134-1","540134-1",0]
[null,"405-Department of Transportation","108-3 Motor Vehicle Account-Federal Unanticipated",{"$f":"LEFT(ActiveFunds!$C671,5)","v":"108-3"},{"$f":"IFERROR(IF(VLOOKUP(D684,#REF!,2,0)=\"O\",0,IF(VLOOKUP(D684,#REF!,2,0)=\"T\",1,0)),\"ERROR\")","v":"ERROR"},null,null,null,null,null,null,null,null,null,null,null,null,null,null,null,null,null,null,null,null,null,null,null,null,null,null,"540","16L-6","54016L-6",0]
[null,"405-Department of Transportation","108-7 Motor Vehicle Account-Private/Local",{"$f":"LEFT(ActiveFunds!$C672,5)","v":"108-7"},{"$f":"IFERROR(IF(VLOOKUP(D685,#REF!,2,0)=\"O\",0,IF(VLOOKUP(D685,#REF!,2,0)=\"T\",1,0)),\"ERROR\")","v":"ERROR"},null,null,null,null,null,null,null,null,null,null,null,null,null,null,null,null,null,null,null,null,null,null,null,null,null,null,"699","001-1","699001-1",0]
[null,"405-Department of Transportation","109-1 Puget Sound Ferry Operations Acct-State",{"$f":"LEFT(ActiveFunds!$C673,5)","v":"109-1"},{"$f":"IFERROR(IF(VLOOKUP(D686,#REF!,2,0)=\"O\",0,IF(VLOOKUP(D686,#REF!,2,0)=\"T\",1,0)),\"ERROR\")","v":"ERROR"},null,null,null,null,null,null,null,null,null,null,null,null,null,null,null,null,null,null,null,null,null,null,null,null,null,null,"699","060-1","699060-1",0]
[null,"405-Department of Transportation","109-2 Puget Sound Ferry Operations Acct-Federal",{"$f":"LEFT(ActiveFunds!$C674,5)","v":"109-2"},{"$f":"IFERROR(IF(VLOOKUP(D687,#REF!,2,0)=\"O\",0,IF(VLOOKUP(D687,#REF!,2,0)=\"T\",1,0)),\"ERROR\")","v":"ERROR"},null,null,null,null,null,null,null,null,null,null,null,null,null,null,null,null,null,null,null,null,null,null,null,null,null,null,"699","08A-1","69908A-1",0]
[null,"405-Department of Transportation","109-7 Puget Sound Ferry Operations Acct-Private/Local",{"$f":"LEFT(ActiveFunds!$C675,5)","v":"109-7"},{"$f":"IFERROR(IF(VLOOKUP(D688,#REF!,2,0)=\"O\",0,IF(VLOOKUP(D688,#REF!,2,0)=\"T\",1,0)),\"ERROR\")","v":"ERROR"},null,null,null,null,null,null,null,null,null,null,null,null,null,null,null,null,null,null,null,null,null,null,null,null,null,null,"699","11A-6","69911A-6",0]
[null,"405-Department of Transportation","11B-1 Regional Mobility Grant Pgm Account-State",{"$f":"LEFT(ActiveFunds!$C676,5)","v":"11B-1"},{"$f":"IFERROR(IF(VLOOKUP(D689,#REF!,2,0)=\"O\",0,IF(VLOOKUP(D689,#REF!,2,0)=\"T\",1,0)),\"ERROR\")","v":"ERROR"},null,null,null,null,null,null,null,null,null,null,null,null,null,null,null,null,null,null,null,null,null,null,null,null,null,null,"699","145-6","699145-6",0]
[null,"405-Department of Transportation","153-1 Rural Mobility Grant Program Acct-State",{"$f":"LEFT(ActiveFunds!$C677,5)","v":"153-1"},{"$f":"IFERROR(IF(VLOOKUP(D690,#REF!,2,0)=\"O\",0,IF(VLOOKUP(D690,#REF!,2,0)=\"T\",1,0)),\"ERROR\")","v":"ERROR"},null,null,null,null,null,null,null,null,null,null,null,null,null,null,null,null,null,null,null,null,null,null,null,null,null,null,"699","148-6","699148-6",0]
[null,"405-Department of Transportation","16J-1 SR 520 Corridor Account-State",{"$f":"LEFT(ActiveFunds!$C678,5)","v":"16J-1"},{"$f":"IFERROR(IF(VLOOKUP(D691,#REF!,2,0)=\"O\",0,IF(VLOOKUP(D691,#REF!,2,0)=\"T\",1,0)),\"ERROR\")","v":"ERROR"},null,null,null,null,null,null,null,null,null,null,null,null,null,null,null,null,null,null,null,null,null,null,null,null,null,null,"699","149-6","699149-6",0]
[null,"405-Department of Transportation","17P-1 SR 520 Civil Penalties Account-State",{"$f":"LEFT(ActiveFunds!$C679,5)","v":"17P-1"},{"$f":"IFERROR(IF(VLOOKUP(D692,#REF!,2,0)=\"O\",0,IF(VLOOKUP(D692,#REF!,2,0)=\"T\",1,0)),\"ERROR\")","v":"ERROR"},null,null,null,null,null,null,null,null,null,null,null,null,null,null,null,null,null,null,null,null,null,null,null,null,null,null,"699","253-1","699253-1",0]
[null,"405-Department of Transportation","20H-1 Connecting Washington Account-State",{"$f":"LEFT(ActiveFunds!$C680,5)","v":"20H-1"},{"$f":"IFERROR(IF(VLOOKUP(D693,#REF!,2,0)=\"O\",0,IF(VLOOKUP(D693,#REF!,2,0)=\"T\",1,0)),\"ERROR\")","v":"ERROR"},null,null,null,null,null,null,null,null,null,null,null,null,null,null,null,null,null,null,null,null,null,null,null,null,null,null,"699","443-6","699443-6",0]
[null,"405-Department of Transportation","20J-1 Electric Vehicle Charging Infras-State",{"$f":"LEFT(ActiveFunds!$C681,5)","v":"20J-1"},{"$f":"IFERROR(IF(VLOOKUP(D694,#REF!,2,0)=\"O\",0,IF(VLOOKUP(D694,#REF!,2,0)=\"T\",1,0)),\"ERROR\")","v":"ERROR"},null,null,null,null,null,null,null,null,null,null,null,null,null,null,null,null,null,null,null,null,null,null,null,null,null,null,"699","561-6","699561-6",0]
[null,"405-Department of Transportation","218-1 Multimodal Transportation Account-State",{"$f":"LEFT(ActiveFunds!$C682,5)","v":"218-1"},{"$f":"IFERROR(IF(VLOOKUP(D695,#REF!,2,0)=\"O\",0,IF(VLOOKUP(D695,#REF!,2,0)=\"T\",1,0)),\"ERROR\")","v":"ERROR"},null,null,null,null,null,null,null,null,null,null,null,null,null,null,null,null,null,null,null,null,null,null,null,null,null,null,"707","001-1","707001-1",0]
[null,"405-Department of Transportation","218-2 Multimodal Transportation Account-Federal",{"$f":"LEFT(ActiveFunds!$C683,5)","v":"218-2"},{"$f":"IFERROR(IF(VLOOKUP(D696,#REF!,2,0)=\"O\",0,IF(VLOOKUP(D696,#REF!,2,0)=\"T\",1,0)),\"ERROR\")","v":"ERROR"},null,null,null,null,null,null,null,null,null,null,null,null,null,null,null,null,null,null,null,null,null,null,null,null,null,null,"740","001-1","740001-1",0]
[null,"405-Department of Transportation","218-7 Multimodal Transportation Account-Private/Local",{"$f":"LEFT(ActiveFunds!$C684,5)","v":"218-7"},{"$f":"IFERROR(IF(VLOOKUP(D697,#REF!,2,0)=\"O\",0,IF(VLOOKUP(D697,#REF!,2,0)=\"T\",1,0)),\"ERROR\")","v":"ERROR"},null,null,null,null,null,null,null,null,null,null,null,null,null,null,null,null,null,null,null,null,null,null,null,null,null,null,"740","600-1","740600-1",0]
[null,"405-Department of Transportation","410-6 Transportation Equipment Account-Non-Appropriated",{"$f":"LEFT(ActiveFunds!$C685,5)","v":"410-6"},{"$f":"IFERROR(IF(VLOOKUP(D698,#REF!,2,0)=\"O\",0,IF(VLOOKUP(D698,#REF!,2,0)=\"T\",1,0)),\"ERROR\")","v":"ERROR"},null,null,null,null,null,null,null,null,null,null,null,null,null,null,null,null,null,null,null,null,null,null,null,null,null,null,"010","09H-1","01009H-1",1]
[null,"405-Department of Transportation","495-6 Toll Collection Account-Non-Appropriated",{"$f":"LEFT(ActiveFunds!$C686,5)","v":"495-6"},{"$f":"IFERROR(IF(VLOOKUP(D699,#REF!,2,0)=\"O\",0,IF(VLOOKUP(D699,#REF!,2,0)=\"T\",1,0)),\"ERROR\")","v":"ERROR"},null,null,null,null,null,null,null,null,null,null,null,null,null,null,null,null,null,null,null,null,null,null,null,null,null,null,"010","108-1","010108-1",1]
[null,"405-Department of Transportation","511-1 Tacoma Narrows Toll Bridge Account-State",{"$f":"LEFT(ActiveFunds!$C687,5)","v":"511-1"},{"$f":"IFERROR(IF(VLOOKUP(D700,#REF!,2,0)=\"O\",0,IF(VLOOKUP(D700,#REF!,2,0)=\"T\",1,0)),\"ERROR\")","v":"ERROR"},null,null,null,null,null,null,null,null,null,null,null,null,null,null,null,null,null,null,null,null,null,null,null,null,null,null,"010","16J-1","01016J-1",1]
[null,"405-Department of Transportation","550-1 Transportation 2003 Acct (Nickel)-State",{"$f":"LEFT(ActiveFunds!$C688,5)","v":"550-1"},{"$f":"IFERROR(IF(VLOOKUP(D701,#REF!,2,0)=\"O\",0,IF(VLOOKUP(D701,#REF!,2,0)=\"T\",1,0)),\"ERROR\")","v":"ERROR"},null,null,null,null,null,null,null,null,null,null,null,null,null,null,null,null,null,null,null,null,null,null,null,null,null,null,"010","303-1","010303-1",1]
[null,"405-Department of Transportation","571-1 Multiuse Roadway Safety Account-State",{"$f":"LEFT(ActiveFunds!$C689,5)","v":"571-1"},{"$f":"IFERROR(IF(VLOOKUP(D702,#REF!,2,0)=\"O\",0,IF(VLOOKUP(D702,#REF!,2,0)=\"T\",1,0)),\"ERROR\")","v":"ERROR"},null,null,null,null,null,null,null,null,null,null,null,null,null,null,null,null,null,null,null,null,null,null,null,null,null,null,"010","304-1","010304-1",1]
[null,"405-Department of Transportation","595-1 I-405 Express Toll Lanes Operations-State",{"$f":"LEFT(ActiveFunds!$C690,5)","v":"595-1"},{"$f":"IFERROR(IF(VLOOKUP(D703,#REF!,2,0)=\"O\",0,IF(VLOOKUP(D703,#REF!,2,0)=\"T\",1,0)),\"ERROR\")","v":"ERROR"},null,null,null,null,null,null,null,null,null,null,null,null,null,null,null,null,null,null,null,null,null,null,null,null,null,null,"010","305-1","010305-1",1]
[null,"405-Department of Transportation","759-6 Miscellaneous Program Account-Non-Appropriated",{"$f":"LEFT(ActiveFunds!$C691,5)","v":"759-6"},{"$f":"IFERROR(IF(VLOOKUP(D704,#REF!,2,0)=\"O\",0,IF(VLOOKUP(D704,#REF!,2,0)=\"T\",1,0)),\"ERROR\")","v":"ERROR"},null,null,null,null,null,null,null,null,null,null,null,null,null,null,null,null,null,null,null,null,null,null,null,null,null,null,"010","383-1","010383-1",1]
[null,"405-Department of Transportation","784-6 Misc Transportation Programs Acct-Non-Appropriated",{"$f":"LEFT(ActiveFunds!$C692,5)","v":"784-6"},{"$f":"IFERROR(IF(VLOOKUP(D705,#REF!,2,0)=\"O\",0,IF(VLOOKUP(D705,#REF!,2,0)=\"T\",1,0)),\"ERROR\")","v":"ERROR"},null,null,null,null,null,null,null,null,null,null,null,null,null,null,null,null,null,null,null,null,null,null,null,null,null,null,"010","389-1","010389-1",1]
[null,"406-County Road Administration Board","102-1 Rural Arterial Trust Account-State",{"$f":"LEFT(ActiveFunds!$C693,5)","v":"102-1"},{"$f":"IFERROR(IF(VLOOKUP(D706,#REF!,2,0)=\"O\",0,IF(VLOOKUP(D706,#REF!,2,0)=\"T\",1,0)),\"ERROR\")","v":"ERROR"},null,null,null,null,null,null,null,null,null,null,null,null,null,null,null,null,null,null,null,null,null,null,null,null,null,null,"010","389-2","010389-2",1]
[null,"406-County Road Administration Board","108-1 Motor Vehicle Account-State",{"$f":"LEFT(ActiveFunds!$C694,5)","v":"108-1"},{"$f":"IFERROR(IF(VLOOKUP(D707,#REF!,2,0)=\"O\",0,IF(VLOOKUP(D707,#REF!,2,0)=\"T\",1,0)),\"ERROR\")","v":"ERROR"},null,null,null,null,null,null,null,null,null,null,null,null,null,null,null,null,null,null,null,null,null,null,null,null,null,null,"010","550-1","010550-1",1]
[null,"406-County Road Administration Board","186-1 County Arterial Preservation Acct-State",{"$f":"LEFT(ActiveFunds!$C695,5)","v":"186-1"},{"$f":"IFERROR(IF(VLOOKUP(D708,#REF!,2,0)=\"O\",0,IF(VLOOKUP(D708,#REF!,2,0)=\"T\",1,0)),\"ERROR\")","v":"ERROR"},null,null,null,null,null,null,null,null,null,null,null,null,null,null,null,null,null,null,null,null,null,null,null,null,null,null,"013","108-1","013108-1",1]
[null,"407-Transportation Improvement Board","144-1 Transportation Improvement Account-State",{"$f":"LEFT(ActiveFunds!$C696,5)","v":"144-1"},{"$f":"IFERROR(IF(VLOOKUP(D709,#REF!,2,0)=\"O\",0,IF(VLOOKUP(D709,#REF!,2,0)=\"T\",1,0)),\"ERROR\")","v":"ERROR"},null,null,null,null,null,null,null,null,null,null,null,null,null,null,null,null,null,null,null,null,null,null,null,null,null,null,"020","108-1","020108-1",1]
[null,"410-Transportation Commission","108-1 Motor Vehicle Account-State",{"$f":"LEFT(ActiveFunds!$C697,5)","v":"108-1"},{"$f":"IFERROR(IF(VLOOKUP(D710,#REF!,2,0)=\"O\",0,IF(VLOOKUP(D710,#REF!,2,0)=\"T\",1,0)),\"ERROR\")","v":"ERROR"},null,null,null,null,null,null,null,null,null,null,null,null,null,null,null,null,null,null,null,null,null,null,null,null,null,null,"105","081-1","105081-1",1]
[null,"410-Transportation Commission","108-2 Motor Vehicle Account-Federal",{"$f":"LEFT(ActiveFunds!$C698,5)","v":"108-2"},{"$f":"IFERROR(IF(VLOOKUP(D711,#REF!,2,0)=\"O\",0,IF(VLOOKUP(D711,#REF!,2,0)=\"T\",1,0)),\"ERROR\")","v":"ERROR"},null,null,null,null,null,null,null,null,null,null,null,null,null,null,null,null,null,null,null,null,null,null,null,null,null,null,"105","108-1","105108-1",1]
[null,"410-Transportation Commission","218-1 Multimodal Transportation Account-State",{"$f":"LEFT(ActiveFunds!$C699,5)","v":"218-1"},{"$f":"IFERROR(IF(VLOOKUP(D712,#REF!,2,0)=\"O\",0,IF(VLOOKUP(D712,#REF!,2,0)=\"T\",1,0)),\"ERROR\")","v":"ERROR"},null,null,null,null,null,null,null,null,null,null,null,null,null,null,null,null,null,null,null,null,null,null,null,null,null,null,"105","109-1","105109-1",1]
[null,"411-Freight Mobility Strategic Invest","108-1 Motor Vehicle Account-State",{"$f":"LEFT(ActiveFunds!$C700,5)","v":"108-1"},{"$f":"IFERROR(IF(VLOOKUP(D713,#REF!,2,0)=\"O\",0,IF(VLOOKUP(D713,#REF!,2,0)=\"T\",1,0)),\"ERROR\")","v":"ERROR"},null,null,null,null,null,null,null,null,null,null,null,null,null,null,null,null,null,null,null,null,null,null,null,null,null,null,"205","025-6","205025-6",1]
[null,"460-Columbia River Gorge Commission","001-1 General Fund-State",{"$f":"LEFT(ActiveFunds!$C701,5)","v":"001-1"},{"$f":"IFERROR(IF(VLOOKUP(D714,#REF!,2,0)=\"O\",0,IF(VLOOKUP(D714,#REF!,2,0)=\"T\",1,0)),\"ERROR\")","v":"ERROR"},null,null,null,null,null,null,null,null,null,null,null,null,null,null,null,null,null,null,null,null,null,null,null,null,null,null,"215","080-1","215080-1",1]
[null,"460-Columbia River Gorge Commission","001-2 General Fund-Federal",{"$f":"LEFT(ActiveFunds!$C702,5)","v":"001-2"},{"$f":"IFERROR(IF(VLOOKUP(D715,#REF!,2,0)=\"O\",0,IF(VLOOKUP(D715,#REF!,2,0)=\"T\",1,0)),\"ERROR\")","v":"ERROR"},null,null,null,null,null,null,null,null,null,null,null,null,null,null,null,null,null,null,null,null,null,null,null,null,null,null,"225","081-1","225081-1",1]
[null,"460-Columbia River Gorge Commission","001-3 General Fund-Federal Unanticipated",{"$f":"LEFT(ActiveFunds!$C703,5)","v":"001-3"},{"$f":"IFERROR(IF(VLOOKUP(D716,#REF!,2,0)=\"O\",0,IF(VLOOKUP(D716,#REF!,2,0)=\"T\",1,0)),\"ERROR\")","v":"ERROR"},null,null,null,null,null,null,null,null,null,null,null,null,null,null,null,null,null,null,null,null,null,null,null,null,null,null,"225","081-2","225081-2",1]
[null,"460-Columbia River Gorge Commission","001-7 General Fund-Private/Local",{"$f":"LEFT(ActiveFunds!$C704,5)","v":"001-7"},{"$f":"IFERROR(IF(VLOOKUP(D717,#REF!,2,0)=\"O\",0,IF(VLOOKUP(D717,#REF!,2,0)=\"T\",1,0)),\"ERROR\")","v":"ERROR"},null,null,null,null,null,null,null,null,null,null,null,null,null,null,null,null,null,null,null,null,null,null,null,null,null,null,"225","081-7","225081-7",1]
[null,"461-Department of Ecology","001-1 General Fund-State",{"$f":"LEFT(ActiveFunds!$C705,5)","v":"001-1"},{"$f":"IFERROR(IF(VLOOKUP(D718,#REF!,2,0)=\"O\",0,IF(VLOOKUP(D718,#REF!,2,0)=\"T\",1,0)),\"ERROR\")","v":"ERROR"},null,null,null,null,null,null,null,null,null,null,null,null,null,null,null,null,null,null,null,null,null,null,null,null,null,null,"225","106-1","225106-1",1]
[null,"461-Department of Ecology","001-2 General Fund-Federal",{"$f":"LEFT(ActiveFunds!$C706,5)","v":"001-2"},{"$f":"IFERROR(IF(VLOOKUP(D719,#REF!,2,0)=\"O\",0,IF(VLOOKUP(D719,#REF!,2,0)=\"T\",1,0)),\"ERROR\")","v":"ERROR"},null,null,null,null,null,null,null,null,null,null,null,null,null,null,null,null,null,null,null,null,null,null,null,null,null,null,"225","14V-1","22514V-1",1]
[null,"461-Department of Ecology","001-7 General Fund-Private/Local",{"$f":"LEFT(ActiveFunds!$C707,5)","v":"001-7"},{"$f":"IFERROR(IF(VLOOKUP(D720,#REF!,2,0)=\"O\",0,IF(VLOOKUP(D720,#REF!,2,0)=\"T\",1,0)),\"ERROR\")","v":"ERROR"},null,null,null,null,null,null,null,null,null,null,null,null,null,null,null,null,null,null,null,null,null,null,null,null,null,null,"225","218-1","225218-1",1]
[null,"461-Department of Ecology","027-1 Reclamation Account-State",{"$f":"LEFT(ActiveFunds!$C708,5)","v":"027-1"},{"$f":"IFERROR(IF(VLOOKUP(D721,#REF!,2,0)=\"O\",0,IF(VLOOKUP(D721,#REF!,2,0)=\"T\",1,0)),\"ERROR\")","v":"ERROR"},null,null,null,null,null,null,null,null,null,null,null,null,null,null,null,null,null,null,null,null,null,null,null,null,null,null,"225","471-6","225471-6",1]
[null,"461-Department of Ecology","02P-1 Flood Control Assistance Account-State",{"$f":"LEFT(ActiveFunds!$C709,5)","v":"02P-1"},{"$f":"IFERROR(IF(VLOOKUP(D722,#REF!,2,0)=\"O\",0,IF(VLOOKUP(D722,#REF!,2,0)=\"T\",1,0)),\"ERROR\")","v":"ERROR"},null,null,null,null,null,null,null,null,null,null,null,null,null,null,null,null,null,null,null,null,null,null,null,null,null,null,"228","106-1","228106-1",1]
[null,"461-Department of Ecology","03K-6 Industrial Insurance Premium Refund-Non-Appropriated",{"$f":"LEFT(ActiveFunds!$C710,5)","v":"03K-6"},{"$f":"IFERROR(IF(VLOOKUP(D723,#REF!,2,0)=\"O\",0,IF(VLOOKUP(D723,#REF!,2,0)=\"T\",1,0)),\"ERROR\")","v":"ERROR"},null,null,null,null,null,null,null,null,null,null,null,null,null,null,null,null,null,null,null,null,null,null,null,null,null,null,"228","106-2",{"$f":"AF710&AG710","v":"228106-2"},1]
[null,"461-Department of Ecology","044-1 Waste Reduct/Recycle/Litter Control-State",{"$f":"LEFT(ActiveFunds!$C711,5)","v":"044-1"},{"$f":"IFERROR(IF(VLOOKUP(D724,#REF!,2,0)=\"O\",0,IF(VLOOKUP(D724,#REF!,2,0)=\"T\",1,0)),\"ERROR\")","v":"ERROR"},null,null,null,null,null,null,null,null,null,null,null,null,null,null,null,null,null,null,null,null,null,null,null,null,null,null,"228","106-7","228106-7",1]
[null,"461-Department of Ecology","05W-1 State Drought Preparedness-State",{"$f":"LEFT(ActiveFunds!$C712,5)","v":"05W-1"},{"$f":"IFERROR(IF(VLOOKUP(D725,#REF!,2,0)=\"O\",0,IF(VLOOKUP(D725,#REF!,2,0)=\"T\",1,0)),\"ERROR\")","v":"ERROR"},null,null,null,null,null,null,null,null,null,null,null,null,null,null,null,null,null,null,null,null,null,null,null,null,null,null,"228","780-1","228780-1",1]
[null,"461-Department of Ecology","072-1 St/Loc Impr Rev Acct Water Sup Fac-State",{"$f":"LEFT(ActiveFunds!$C713,5)","v":"072-1"},{"$f":"IFERROR(IF(VLOOKUP(D726,#REF!,2,0)=\"O\",0,IF(VLOOKUP(D726,#REF!,2,0)=\"T\",1,0)),\"ERROR\")","v":"ERROR"},null,null,null,null,null,null,null,null,null,null,null,null,null,null,null,null,null,null,null,null,null,null,null,null,null,null,"240","048-1","240048-1",1]
[null,"461-Department of Ecology","108-1 Motor Vehicle Account-State",{"$f":"LEFT(ActiveFunds!$C714,5)","v":"108-1"},{"$f":"IFERROR(IF(VLOOKUP(D727,#REF!,2,0)=\"O\",0,IF(VLOOKUP(D727,#REF!,2,0)=\"T\",1,0)),\"ERROR\")","v":"ERROR"},null,null,null,null,null,null,null,null,null,null,null,null,null,null,null,null,null,null,null,null,null,null,null,null,null,null,"240","06T-1","24006T-1",1]
[null,"461-Department of Ecology","10A-1 Aquatic Algae Control Account-State",{"$f":"LEFT(ActiveFunds!$C715,5)","v":"10A-1"},{"$f":"IFERROR(IF(VLOOKUP(D728,#REF!,2,0)=\"O\",0,IF(VLOOKUP(D728,#REF!,2,0)=\"T\",1,0)),\"ERROR\")","v":"ERROR"},null,null,null,null,null,null,null,null,null,null,null,null,null,null,null,null,null,null,null,null,null,null,null,null,null,null,"240","082-1","240082-1",1]
[null,"461-Department of Ecology","10G-1 Water Rights Tracking System Acct-State",{"$f":"LEFT(ActiveFunds!$C716,5)","v":"10G-1"},{"$f":"IFERROR(IF(VLOOKUP(D729,#REF!,2,0)=\"O\",0,IF(VLOOKUP(D729,#REF!,2,0)=\"T\",1,0)),\"ERROR\")","v":"ERROR"},null,null,null,null,null,null,null,null,null,null,null,null,null,null,null,null,null,null,null,null,null,null,null,null,null,null,"240","104-1","240104-1",1]
[null,"461-Department of Ecology","116-6 Basic Data Account-Non-Appropriated",{"$f":"LEFT(ActiveFunds!$C717,5)","v":"116-6"},{"$f":"IFERROR(IF(VLOOKUP(D730,#REF!,2,0)=\"O\",0,IF(VLOOKUP(D730,#REF!,2,0)=\"T\",1,0)),\"ERROR\")","v":"ERROR"},null,null,null,null,null,null,null,null,null,null,null,null,null,null,null,null,null,null,null,null,null,null,null,null,null,null,"240","106-1","240106-1",1]
[null,"461-Department of Ecology","11J-6 Electronic Products Recycling-Non-Appropriated",{"$f":"LEFT(ActiveFunds!$C718,5)","v":"11J-6"},{"$f":"IFERROR(IF(VLOOKUP(D731,#REF!,2,0)=\"O\",0,IF(VLOOKUP(D731,#REF!,2,0)=\"T\",1,0)),\"ERROR\")","v":"ERROR"},null,null,null,null,null,null,null,null,null,null,null,null,null,null,null,null,null,null,null,null,null,null,null,null,null,null,"240","106-2","240106-2",1]
[null,"461-Department of Ecology","125-1 Site Closure Account-State",{"$f":"LEFT(ActiveFunds!$C719,5)","v":"125-1"},{"$f":"IFERROR(IF(VLOOKUP(D732,#REF!,2,0)=\"O\",0,IF(VLOOKUP(D732,#REF!,2,0)=\"T\",1,0)),\"ERROR\")","v":"ERROR"},null,null,null,null,null,null,null,null,null,null,null,null,null,null,null,null,null,null,null,null,null,null,null,null,null,null,"240","108-1","240108-1",1]
[null,"461-Department of Ecology","160-1 Wood Stove Education/Enforcement-State",{"$f":"LEFT(ActiveFunds!$C720,5)","v":"160-1"},{"$f":"IFERROR(IF(VLOOKUP(D733,#REF!,2,0)=\"O\",0,IF(VLOOKUP(D733,#REF!,2,0)=\"T\",1,0)),\"ERROR\")","v":"ERROR"},null,null,null,null,null,null,null,null,null,null,null,null,null,null,null,null,null,null,null,null,null,null,null,null,null,null,"240","108-2","240108-2",1]
[null,"461-Department of Ecology","163-1 Worker/Community Right to Know Acct-State",{"$f":"LEFT(ActiveFunds!$C721,5)","v":"163-1"},{"$f":"IFERROR(IF(VLOOKUP(D734,#REF!,2,0)=\"O\",0,IF(VLOOKUP(D734,#REF!,2,0)=\"T\",1,0)),\"ERROR\")","v":"ERROR"},null,null,null,null,null,null,null,null,null,null,null,null,null,null,null,null,null,null,null,null,null,null,null,null,null,null,"240","108-7","240108-7",1]
[null,"461-Department of Ecology","16T-6 Product Stewardship Programs Acct-Non-Appropriated",{"$f":"LEFT(ActiveFunds!$C722,5)","v":"16T-6"},{"$f":"IFERROR(IF(VLOOKUP(D735,#REF!,2,0)=\"O\",0,IF(VLOOKUP(D735,#REF!,2,0)=\"T\",1,0)),\"ERROR\")","v":"ERROR"},null,null,null,null,null,null,null,null,null,null,null,null,null,null,null,null,null,null,null,null,null,null,null,null,null,null,"240","14V-1","24014V-1",1]
[null,"461-Department of Ecology","16V-1 Water Rights Processing Account-State",{"$f":"LEFT(ActiveFunds!$C723,5)","v":"16V-1"},{"$f":"IFERROR(IF(VLOOKUP(D736,#REF!,2,0)=\"O\",0,IF(VLOOKUP(D736,#REF!,2,0)=\"T\",1,0)),\"ERROR\")","v":"ERROR"},null,null,null,null,null,null,null,null,null,null,null,null,null,null,null,null,null,null,null,null,null,null,null,null,null,null,"240","201-1","240201-1",1]
[null,"461-Department of Ecology","173-1 State Toxics Control Account-State",{"$f":"LEFT(ActiveFunds!$C724,5)","v":"173-1"},{"$f":"IFERROR(IF(VLOOKUP(D737,#REF!,2,0)=\"O\",0,IF(VLOOKUP(D737,#REF!,2,0)=\"T\",1,0)),\"ERROR\")","v":"ERROR"},null,null,null,null,null,null,null,null,null,null,null,null,null,null,null,null,null,null,null,null,null,null,null,null,null,null,"355","108-1","355108-1",1]
[null,"461-Department of Ecology","173-7 State Toxics Control Account-Private/Local",{"$f":"LEFT(ActiveFunds!$C725,5)","v":"173-7"},{"$f":"IFERROR(IF(VLOOKUP(D738,#REF!,2,0)=\"O\",0,IF(VLOOKUP(D738,#REF!,2,0)=\"T\",1,0)),\"ERROR\")","v":"ERROR"},null,null,null,null,null,null,null,null,null,null,null,null,null,null,null,null,null,null,null,null,null,null,null,null,null,null,"376","108-1","376108-1",1]
[null,"461-Department of Ecology","174-1 Local Toxics Control Account-State",{"$f":"LEFT(ActiveFunds!$C726,5)","v":"174-1"},{"$f":"IFERROR(IF(VLOOKUP(D739,#REF!,2,0)=\"O\",0,IF(VLOOKUP(D739,#REF!,2,0)=\"T\",1,0)),\"ERROR\")","v":"ERROR"},null,null,null,null,null,null,null,null,null,null,null,null,null,null,null,null,null,null,null,null,null,null,null,null,null,null,"405","02M-1","40502M-1",1]
[null,"461-Department of Ecology","176-1 Water Quality Permit Account-State",{"$f":"LEFT(ActiveFunds!$C727,5)","v":"176-1"},{"$f":"IFERROR(IF(VLOOKUP(D740,#REF!,2,0)=\"O\",0,IF(VLOOKUP(D740,#REF!,2,0)=\"T\",1,0)),\"ERROR\")","v":"ERROR"},null,null,null,null,null,null,null,null,null,null,null,null,null,null,null,null,null,null,null,null,null,null,null,null,null,null,"405","039-1","405039-1",1]
[null,"461-Department of Ecology","182-1 Underground Storage Tank Account-State",{"$f":"LEFT(ActiveFunds!$C728,5)","v":"182-1"},{"$f":"IFERROR(IF(VLOOKUP(D741,#REF!,2,0)=\"O\",0,IF(VLOOKUP(D741,#REF!,2,0)=\"T\",1,0)),\"ERROR\")","v":"ERROR"},null,null,null,null,null,null,null,null,null,null,null,null,null,null,null,null,null,null,null,null,null,null,null,null,null,null,"405","039-2","405039-2",1]
[null,"461-Department of Ecology","199-1 Biosolids Permit Account-State",{"$f":"LEFT(ActiveFunds!$C729,5)","v":"199-1"},{"$f":"IFERROR(IF(VLOOKUP(D742,#REF!,2,0)=\"O\",0,IF(VLOOKUP(D742,#REF!,2,0)=\"T\",1,0)),\"ERROR\")","v":"ERROR"},null,null,null,null,null,null,null,null,null,null,null,null,null,null,null,null,null,null,null,null,null,null,null,null,null,null,"405","039-7","405039-7",1]
[null,"461-Department of Ecology","19G-1 Environmental Legacy Stewardship-State",{"$f":"LEFT(ActiveFunds!$C730,5)","v":"19G-1"},{"$f":"IFERROR(IF(VLOOKUP(D743,#REF!,2,0)=\"O\",0,IF(VLOOKUP(D743,#REF!,2,0)=\"T\",1,0)),\"ERROR\")","v":"ERROR"},null,null,null,null,null,null,null,null,null,null,null,null,null,null,null,null,null,null,null,null,null,null,null,null,null,null,"405","045-1","405045-1",1]
[null,"461-Department of Ecology","207-1 Hazardous Waste Assistance Account-State",{"$f":"LEFT(ActiveFunds!$C731,5)","v":"207-1"},{"$f":"IFERROR(IF(VLOOKUP(D744,#REF!,2,0)=\"O\",0,IF(VLOOKUP(D744,#REF!,2,0)=\"T\",1,0)),\"ERROR\")","v":"ERROR"},null,null,null,null,null,null,null,null,null,null,null,null,null,null,null,null,null,null,null,null,null,null,null,null,null,null,"405","094-1","405094-1",1]
[null,"461-Department of Ecology","20R-1 Radioactive Mixed Waste Account-State",{"$f":"LEFT(ActiveFunds!$C732,5)","v":"20R-1"},{"$f":"IFERROR(IF(VLOOKUP(D745,#REF!,2,0)=\"O\",0,IF(VLOOKUP(D745,#REF!,2,0)=\"T\",1,0)),\"ERROR\")","v":"ERROR"},null,null,null,null,null,null,null,null,null,null,null,null,null,null,null,null,null,null,null,null,null,null,null,null,null,null,"405","096-1","405096-1",1]
[null,"461-Department of Ecology","216-1 Air Pollution Control Account-State",{"$f":"LEFT(ActiveFunds!$C733,5)","v":"216-1"},{"$f":"IFERROR(IF(VLOOKUP(D746,#REF!,2,0)=\"O\",0,IF(VLOOKUP(D746,#REF!,2,0)=\"T\",1,0)),\"ERROR\")","v":"ERROR"},null,null,null,null,null,null,null,null,null,null,null,null,null,null,null,null,null,null,null,null,null,null,null,null,null,null,"405","096-2","405096-2",1]
[null,"461-Department of Ecology","217-1 Oil Spill Prevention Account-State",{"$f":"LEFT(ActiveFunds!$C734,5)","v":"217-1"},{"$f":"IFERROR(IF(VLOOKUP(D747,#REF!,2,0)=\"O\",0,IF(VLOOKUP(D747,#REF!,2,0)=\"T\",1,0)),\"ERROR\")","v":"ERROR"},null,null,null,null,null,null,null,null,null,null,null,null,null,null,null,null,null,null,null,null,null,null,null,null,null,null,"405","097-1","405097-1",1]
[null,"461-Department of Ecology","219-1 Air Operating Permit Account-State",{"$f":"LEFT(ActiveFunds!$C735,5)","v":"219-1"},{"$f":"IFERROR(IF(VLOOKUP(D748,#REF!,2,0)=\"O\",0,IF(VLOOKUP(D748,#REF!,2,0)=\"T\",1,0)),\"ERROR\")","v":"ERROR"},null,null,null,null,null,null,null,null,null,null,null,null,null,null,null,null,null,null,null,null,null,null,null,null,null,null,"405","099-1","405099-1",1]
[null,"461-Department of Ecology","222-1 Freshwater Aquatic Weeds Account-State",{"$f":"LEFT(ActiveFunds!$C736,5)","v":"222-1"},{"$f":"IFERROR(IF(VLOOKUP(D749,#REF!,2,0)=\"O\",0,IF(VLOOKUP(D749,#REF!,2,0)=\"T\",1,0)),\"ERROR\")","v":"ERROR"},null,null,null,null,null,null,null,null,null,null,null,null,null,null,null,null,null,null,null,null,null,null,null,null,null,null,"405","099-2","405099-2",1]
[null,"461-Department of Ecology","223-1 Oil Spill Response Account-State",{"$f":"LEFT(ActiveFunds!$C737,5)","v":"223-1"},{"$f":"IFERROR(IF(VLOOKUP(D750,#REF!,2,0)=\"O\",0,IF(VLOOKUP(D750,#REF!,2,0)=\"T\",1,0)),\"ERROR\")","v":"ERROR"},null,null,null,null,null,null,null,null,null,null,null,null,null,null,null,null,null,null,null,null,null,null,null,null,null,null,"405","099-7","405099-7",1]
[null,"461-Department of Ecology","277-6 State Agency Parking Account-Non-Appropriated",{"$f":"LEFT(ActiveFunds!$C738,5)","v":"277-6"},{"$f":"IFERROR(IF(VLOOKUP(D751,#REF!,2,0)=\"O\",0,IF(VLOOKUP(D751,#REF!,2,0)=\"T\",1,0)),\"ERROR\")","v":"ERROR"},null,null,null,null,null,null,null,null,null,null,null,null,null,null,null,null,null,null,null,null,null,null,null,null,null,null,"405","09F-1","40509F-1",1]
[null,"461-Department of Ecology","408-6 Coastal Protection Account-Non-Appropriated",{"$f":"LEFT(ActiveFunds!$C739,5)","v":"408-6"},{"$f":"IFERROR(IF(VLOOKUP(D752,#REF!,2,0)=\"O\",0,IF(VLOOKUP(D752,#REF!,2,0)=\"T\",1,0)),\"ERROR\")","v":"ERROR"},null,null,null,null,null,null,null,null,null,null,null,null,null,null,null,null,null,null,null,null,null,null,null,null,null,null,"405","09H-1","40509H-1",1]
[null,"461-Department of Ecology","447-6 Info Tech Invest Rev Acct-Non-Appropriated",{"$f":"LEFT(ActiveFunds!$C740,5)","v":"447-6"},{"$f":"IFERROR(IF(VLOOKUP(D753,#REF!,2,0)=\"O\",0,IF(VLOOKUP(D753,#REF!,2,0)=\"T\",1,0)),\"ERROR\")","v":"ERROR"},null,null,null,null,null,null,null,null,null,null,null,null,null,null,null,null,null,null,null,null,null,null,null,null,null,null,"405","09H-T","40509H-T",1]
[null,"461-Department of Ecology","564-1 Water Pollution Ctrl Revl Admin-State",{"$f":"LEFT(ActiveFunds!$C741,5)","v":"564-1"},{"$f":"IFERROR(IF(VLOOKUP(D754,#REF!,2,0)=\"O\",0,IF(VLOOKUP(D754,#REF!,2,0)=\"T\",1,0)),\"ERROR\")","v":"ERROR"},null,null,null,null,null,null,null,null,null,null,null,null,null,null,null,null,null,null,null,null,null,null,null,null,null,null,"405","106-1","405106-1",1]
[null,"461-Department of Ecology","727-1 Water Pollution Control Revolving-State",{"$f":"LEFT(ActiveFunds!$C742,5)","v":"727-1"},{"$f":"IFERROR(IF(VLOOKUP(D755,#REF!,2,0)=\"O\",0,IF(VLOOKUP(D755,#REF!,2,0)=\"T\",1,0)),\"ERROR\")","v":"ERROR"},null,null,null,null,null,null,null,null,null,null,null,null,null,null,null,null,null,null,null,null,null,null,null,null,null,null,"405","108-1","405108-1",1]
[null,"461-Department of Ecology","727-2 Water Pollution Control Revolving-Federal",{"$f":"LEFT(ActiveFunds!$C743,5)","v":"727-2"},{"$f":"IFERROR(IF(VLOOKUP(D756,#REF!,2,0)=\"O\",0,IF(VLOOKUP(D756,#REF!,2,0)=\"T\",1,0)),\"ERROR\")","v":"ERROR"},null,null,null,null,null,null,null,null,null,null,null,null,null,null,null,null,null,null,null,null,null,null,null,null,null,null,"405","108-2","405108-2",1]
[null,"462-WA Pollution Liab Insurance Program","20T-1 Underground Storage Tank Revolving-State",{"$f":"LEFT(ActiveFunds!$C744,5)","v":"20T-1"},{"$f":"IFERROR(IF(VLOOKUP(D757,#REF!,2,0)=\"O\",0,IF(VLOOKUP(D757,#REF!,2,0)=\"T\",1,0)),\"ERROR\")","v":"ERROR"},null,null,null,null,null,null,null,null,null,null,null,null,null,null,null,null,null,null,null,null,null,null,null,null,null,null,"405","108-7","405108-7",1]
[null,"462-WA Pollution Liab Insurance Program","544-1 Pollution Liab Insurance Prog Trust-State",{"$f":"LEFT(ActiveFunds!$C745,5)","v":"544-1"},{"$f":"IFERROR(IF(VLOOKUP(D758,#REF!,2,0)=\"O\",0,IF(VLOOKUP(D758,#REF!,2,0)=\"T\",1,0)),\"ERROR\")","v":"ERROR"},null,null,null,null,null,null,null,null,null,null,null,null,null,null,null,null,null,null,null,null,null,null,null,null,null,null,"405","109-1","405109-1",1]
[null,"462-WA Pollution Liab Insurance Program","544-6 Pollution Liab Insurance Prog Trust-Non-Appropriated",{"$f":"LEFT(ActiveFunds!$C746,5)","v":"544-6"},{"$f":"IFERROR(IF(VLOOKUP(D759,#REF!,2,0)=\"O\",0,IF(VLOOKUP(D759,#REF!,2,0)=\"T\",1,0)),\"ERROR\")","v":"ERROR"},null,null,null,null,null,null,null,null,null,null,null,null,null,null,null,null,null,null,null,null,null,null,null,null,null,null,"405","109-2","405109-2",1]
[null,"462-WA Pollution Liab Insurance Program","545-6 Heating Oil Pollution Liab Trust-Non-Appropriated",{"$f":"LEFT(ActiveFunds!$C747,5)","v":"545-6"},{"$f":"IFERROR(IF(VLOOKUP(D760,#REF!,2,0)=\"O\",0,IF(VLOOKUP(D760,#REF!,2,0)=\"T\",1,0)),\"ERROR\")","v":"ERROR"},null,null,null,null,null,null,null,null,null,null,null,null,null,null,null,null,null,null,null,null,null,null,null,null,null,null,"405","109-7","405109-7",1]
[null,"465-State Parks and Recreation Comm","001-1 General Fund-State",{"$f":"LEFT(ActiveFunds!$C748,5)","v":"001-1"},{"$f":"IFERROR(IF(VLOOKUP(D761,#REF!,2,0)=\"O\",0,IF(VLOOKUP(D761,#REF!,2,0)=\"T\",1,0)),\"ERROR\")","v":"ERROR"},null,null,null,null,null,null,null,null,null,null,null,null,null,null,null,null,null,null,null,null,null,null,null,null,null,null,"405","11B-1","40511B-1",1]
[null,"465-State Parks and Recreation Comm","001-2 General Fund-Federal",{"$f":"LEFT(ActiveFunds!$C749,5)","v":"001-2"},{"$f":"IFERROR(IF(VLOOKUP(D762,#REF!,2,0)=\"O\",0,IF(VLOOKUP(D762,#REF!,2,0)=\"T\",1,0)),\"ERROR\")","v":"ERROR"},null,null,null,null,null,null,null,null,null,null,null,null,null,null,null,null,null,null,null,null,null,null,null,null,null,null,"405","153-1","405153-1",1]
[null,"465-State Parks and Recreation Comm","007-1 Winter Recreation Program Account-State",{"$f":"LEFT(ActiveFunds!$C750,5)","v":"007-1"},{"$f":"IFERROR(IF(VLOOKUP(D763,#REF!,2,0)=\"O\",0,IF(VLOOKUP(D763,#REF!,2,0)=\"T\",1,0)),\"ERROR\")","v":"ERROR"},null,null,null,null,null,null,null,null,null,null,null,null,null,null,null,null,null,null,null,null,null,null,null,null,null,null,"405","16J-1","40516J-1",1]
[null,"465-State Parks and Recreation Comm","01B-1 ORV & Non-Highway Vehicle Account-State",{"$f":"LEFT(ActiveFunds!$C751,5)","v":"01B-1"},{"$f":"IFERROR(IF(VLOOKUP(D764,#REF!,2,0)=\"O\",0,IF(VLOOKUP(D764,#REF!,2,0)=\"T\",1,0)),\"ERROR\")","v":"ERROR"},null,null,null,null,null,null,null,null,null,null,null,null,null,null,null,null,null,null,null,null,null,null,null,null,null,null,"405","16J-2","40516J-2",1]
[null,"465-State Parks and Recreation Comm","01M-1 Snowmobile Account-State",{"$f":"LEFT(ActiveFunds!$C752,5)","v":"01M-1"},{"$f":"IFERROR(IF(VLOOKUP(D765,#REF!,2,0)=\"O\",0,IF(VLOOKUP(D765,#REF!,2,0)=\"T\",1,0)),\"ERROR\")","v":"ERROR"},null,null,null,null,null,null,null,null,null,null,null,null,null,null,null,null,null,null,null,null,null,null,null,null,null,null,"405","16J-T","40516J-T",1]
[null,"465-State Parks and Recreation Comm","02R-1 Aquatic Lands Enhancement Account-State",{"$f":"LEFT(ActiveFunds!$C753,5)","v":"02R-1"},{"$f":"IFERROR(IF(VLOOKUP(D766,#REF!,2,0)=\"O\",0,IF(VLOOKUP(D766,#REF!,2,0)=\"T\",1,0)),\"ERROR\")","v":"ERROR"},null,null,null,null,null,null,null,null,null,null,null,null,null,null,null,null,null,null,null,null,null,null,null,null,null,null,"405","17P-1","40517P-1",1]
[null,"465-State Parks and Recreation Comm","08P-6 State Parks Education & Enhancement-Non-Appropriated",{"$f":"LEFT(ActiveFunds!$C754,5)","v":"08P-6"},{"$f":"IFERROR(IF(VLOOKUP(D767,#REF!,2,0)=\"O\",0,IF(VLOOKUP(D767,#REF!,2,0)=\"T\",1,0)),\"ERROR\")","v":"ERROR"},null,null,null,null,null,null,null,null,null,null,null,null,null,null,null,null,null,null,null,null,null,null,null,null,null,null,"405","20H-1","40520H-1",1]
[null,"465-State Parks and Recreation Comm","09B-6 Boating Safety Edu Cert Account-Non-Appropriated",{"$f":"LEFT(ActiveFunds!$C755,5)","v":"09B-6"},{"$f":"IFERROR(IF(VLOOKUP(D768,#REF!,2,0)=\"O\",0,IF(VLOOKUP(D768,#REF!,2,0)=\"T\",1,0)),\"ERROR\")","v":"ERROR"},null,null,null,null,null,null,null,null,null,null,null,null,null,null,null,null,null,null,null,null,null,null,null,null,null,null,"405","20J-1","40520J-1",1]
[null,"465-State Parks and Recreation Comm","108-1 Motor Vehicle Account-State",{"$f":"LEFT(ActiveFunds!$C756,5)","v":"108-1"},{"$f":"IFERROR(IF(VLOOKUP(D769,#REF!,2,0)=\"O\",0,IF(VLOOKUP(D769,#REF!,2,0)=\"T\",1,0)),\"ERROR\")","v":"ERROR"},null,null,null,null,null,null,null,null,null,null,null,null,null,null,null,null,null,null,null,null,null,null,null,null,null,null,"405","215-1","405215-1",1]
[null,"465-State Parks and Recreation Comm","12L-6 Outdoor Education & Recreation Acct-Non-Appropriated",{"$f":"LEFT(ActiveFunds!$C757,5)","v":"12L-6"},{"$f":"IFERROR(IF(VLOOKUP(D770,#REF!,2,0)=\"O\",0,IF(VLOOKUP(D770,#REF!,2,0)=\"T\",1,0)),\"ERROR\")","v":"ERROR"},null,null,null,null,null,null,null,null,null,null,null,null,null,null,null,null,null,null,null,null,null,null,null,null,null,null,"405","218-1","405218-1",1]
[null,"465-State Parks and Recreation Comm","159-6 Parks Improvement Account-Non-Appropriated",{"$f":"LEFT(ActiveFunds!$C758,5)","v":"159-6"},{"$f":"IFERROR(IF(VLOOKUP(D771,#REF!,2,0)=\"O\",0,IF(VLOOKUP(D771,#REF!,2,0)=\"T\",1,0)),\"ERROR\")","v":"ERROR"},null,null,null,null,null,null,null,null,null,null,null,null,null,null,null,null,null,null,null,null,null,null,null,null,null,null,"405","218-2","405218-2",1]
[null,"465-State Parks and Recreation Comm","237-1 Recreation Access Pass Account-State",{"$f":"LEFT(ActiveFunds!$C759,5)","v":"237-1"},{"$f":"IFERROR(IF(VLOOKUP(D772,#REF!,2,0)=\"O\",0,IF(VLOOKUP(D772,#REF!,2,0)=\"T\",1,0)),\"ERROR\")","v":"ERROR"},null,null,null,null,null,null,null,null,null,null,null,null,null,null,null,null,null,null,null,null,null,null,null,null,null,null,"405","218-7","405218-7",1]
[null,"465-State Parks and Recreation Comm","269-1 Parks Renewal & Stewardship Acct-State",{"$f":"LEFT(ActiveFunds!$C760,5)","v":"269-1"},{"$f":"IFERROR(IF(VLOOKUP(D773,#REF!,2,0)=\"O\",0,IF(VLOOKUP(D773,#REF!,2,0)=\"T\",1,0)),\"ERROR\")","v":"ERROR"},null,null,null,null,null,null,null,null,null,null,null,null,null,null,null,null,null,null,null,null,null,null,null,null,null,null,"405","218-8","405218-8",1]
[null,"465-State Parks and Recreation Comm","269-7 Parks Renewal & Stewardship Acct-Private/Local",{"$f":"LEFT(ActiveFunds!$C761,5)","v":"269-7"},{"$f":"IFERROR(IF(VLOOKUP(D774,#REF!,2,0)=\"O\",0,IF(VLOOKUP(D774,#REF!,2,0)=\"T\",1,0)),\"ERROR\")","v":"ERROR"},null,null,null,null,null,null,null,null,null,null,null,null,null,null,null,null,null,null,null,null,null,null,null,null,null,null,"405","410-6","405410-6",1]
[null,"467-Rec and Conservation Funding Board","001-1 General Fund-State",{"$f":"LEFT(ActiveFunds!$C762,5)","v":"001-1"},{"$f":"IFERROR(IF(VLOOKUP(D775,#REF!,2,0)=\"O\",0,IF(VLOOKUP(D775,#REF!,2,0)=\"T\",1,0)),\"ERROR\")","v":"ERROR"},null,null,null,null,null,null,null,null,null,null,null,null,null,null,null,null,null,null,null,null,null,null,null,null,null,null,"405","511-1","405511-1",1]
[null,"467-Rec and Conservation Funding Board","001-2 General Fund-Federal",{"$f":"LEFT(ActiveFunds!$C763,5)","v":"001-2"},{"$f":"IFERROR(IF(VLOOKUP(D776,#REF!,2,0)=\"O\",0,IF(VLOOKUP(D776,#REF!,2,0)=\"T\",1,0)),\"ERROR\")","v":"ERROR"},null,null,null,null,null,null,null,null,null,null,null,null,null,null,null,null,null,null,null,null,null,null,null,null,null,null,"405","550-1","405550-1",1]
[null,"467-Rec and Conservation Funding Board","001-7 General Fund-Private/Local",{"$f":"LEFT(ActiveFunds!$C764,5)","v":"001-7"},{"$f":"IFERROR(IF(VLOOKUP(D777,#REF!,2,0)=\"O\",0,IF(VLOOKUP(D777,#REF!,2,0)=\"T\",1,0)),\"ERROR\")","v":"ERROR"},null,null,null,null,null,null,null,null,null,null,null,null,null,null,null,null,null,null,null,null,null,null,null,null,null,null,"405","550-T","405550-T",1]
[null,"467-Rec and Conservation Funding Board","02R-1 Aquatic Lands Enhancement Account-State",{"$f":"LEFT(ActiveFunds!$C765,5)","v":"02R-1"},{"$f":"IFERROR(IF(VLOOKUP(D778,#REF!,2,0)=\"O\",0,IF(VLOOKUP(D778,#REF!,2,0)=\"T\",1,0)),\"ERROR\")","v":"ERROR"},null,null,null,null,null,null,null,null,null,null,null,null,null,null,null,null,null,null,null,null,null,null,null,null,null,null,"405","571-1","405571-1",1]
[null,"467-Rec and Conservation Funding Board","03K-6 Industrial Insurance Premium Refund-Non-Appropriated",{"$f":"LEFT(ActiveFunds!$C766,5)","v":"03K-6"},{"$f":"IFERROR(IF(VLOOKUP(D779,#REF!,2,0)=\"O\",0,IF(VLOOKUP(D779,#REF!,2,0)=\"T\",1,0)),\"ERROR\")","v":"ERROR"},null,null,null,null,null,null,null,null,null,null,null,null,null,null,null,null,null,null,null,null,null,null,null,null,null,null,"405","595-1","405595-1",1]
[null,"467-Rec and Conservation Funding Board","146-1 Firearms Range Account-State",{"$f":"LEFT(ActiveFunds!$C767,5)","v":"146-1"},{"$f":"IFERROR(IF(VLOOKUP(D780,#REF!,2,0)=\"O\",0,IF(VLOOKUP(D780,#REF!,2,0)=\"T\",1,0)),\"ERROR\")","v":"ERROR"},null,null,null,null,null,null,null,null,null,null,null,null,null,null,null,null,null,null,null,null,null,null,null,null,null,null,"406","102-1","406102-1",1]
[null,"467-Rec and Conservation Funding Board","267-1 Recreation Resources Account-State",{"$f":"LEFT(ActiveFunds!$C768,5)","v":"267-1"},{"$f":"IFERROR(IF(VLOOKUP(D781,#REF!,2,0)=\"O\",0,IF(VLOOKUP(D781,#REF!,2,0)=\"T\",1,0)),\"ERROR\")","v":"ERROR"},null,null,null,null,null,null,null,null,null,null,null,null,null,null,null,null,null,null,null,null,null,null,null,null,null,null,"406","108-1","406108-1",1]
[null,"467-Rec and Conservation Funding Board","268-1 NOVA Program Account-State",{"$f":"LEFT(ActiveFunds!$C769,5)","v":"268-1"},{"$f":"IFERROR(IF(VLOOKUP(D782,#REF!,2,0)=\"O\",0,IF(VLOOKUP(D782,#REF!,2,0)=\"T\",1,0)),\"ERROR\")","v":"ERROR"},null,null,null,null,null,null,null,null,null,null,null,null,null,null,null,null,null,null,null,null,null,null,null,null,null,null,"406","186-1","406186-1",1]
[null,"467-Rec and Conservation Funding Board","818-6 Youth Athletic Facility Account-Non-Appropriated",{"$f":"LEFT(ActiveFunds!$C770,5)","v":"818-6"},{"$f":"IFERROR(IF(VLOOKUP(D783,#REF!,2,0)=\"O\",0,IF(VLOOKUP(D783,#REF!,2,0)=\"T\",1,0)),\"ERROR\")","v":"ERROR"},null,null,null,null,null,null,null,null,null,null,null,null,null,null,null,null,null,null,null,null,null,null,null,null,null,null,"407","08M-1","40708M-1",1]
[null,"468-Environ & Land Use Hearings Office","001-1 General Fund-State",{"$f":"LEFT(ActiveFunds!$C771,5)","v":"001-1"},{"$f":"IFERROR(IF(VLOOKUP(D784,#REF!,2,0)=\"O\",0,IF(VLOOKUP(D784,#REF!,2,0)=\"T\",1,0)),\"ERROR\")","v":"ERROR"},null,null,null,null,null,null,null,null,null,null,null,null,null,null,null,null,null,null,null,null,null,null,null,null,null,null,"407","106-1","407106-1",1]
[null,"471-State Conservation Commission","001-1 General Fund-State",{"$f":"LEFT(ActiveFunds!$C772,5)","v":"001-1"},{"$f":"IFERROR(IF(VLOOKUP(D785,#REF!,2,0)=\"O\",0,IF(VLOOKUP(D785,#REF!,2,0)=\"T\",1,0)),\"ERROR\")","v":"ERROR"},null,null,null,null,null,null,null,null,null,null,null,null,null,null,null,null,null,null,null,null,null,null,null,null,null,null,"407","144-1","407144-1",1]
[null,"471-State Conservation Commission","001-2 General Fund-Federal",{"$f":"LEFT(ActiveFunds!$C773,5)","v":"001-2"},{"$f":"IFERROR(IF(VLOOKUP(D786,#REF!,2,0)=\"O\",0,IF(VLOOKUP(D786,#REF!,2,0)=\"T\",1,0)),\"ERROR\")","v":"ERROR"},null,null,null,null,null,null,null,null,null,null,null,null,null,null,null,null,null,null,null,null,null,null,null,null,null,null,"407","218-1","407218-1",1]
[null,"471-State Conservation Commission","03K-6 Industrial Insurance Premium Refund-Non-Appropriated",{"$f":"LEFT(ActiveFunds!$C774,5)","v":"03K-6"},{"$f":"IFERROR(IF(VLOOKUP(D787,#REF!,2,0)=\"O\",0,IF(VLOOKUP(D787,#REF!,2,0)=\"T\",1,0)),\"ERROR\")","v":"ERROR"},null,null,null,null,null,null,null,null,null,null,null,null,null,null,null,null,null,null,null,null,null,null,null,null,null,null,"410","108-1",{"$f":"AF774&AG774","v":"410108-1"},1]
[null,"471-State Conservation Commission","058-1 Public Works Assistance Account-State",{"$f":"LEFT(ActiveFunds!$C775,5)","v":"058-1"},{"$f":"IFERROR(IF(VLOOKUP(D788,#REF!,2,0)=\"O\",0,IF(VLOOKUP(D788,#REF!,2,0)=\"T\",1,0)),\"ERROR\")","v":"ERROR"},null,null,null,null,null,null,null,null,null,null,null,null,null,null,null,null,null,null,null,null,null,null,null,null,null,null,"410","108-2","410108-2",1]
[null,"471-State Conservation Commission","05H-1 Disaster Response Account-State",{"$f":"LEFT(ActiveFunds!$C776,5)","v":"05H-1"},{"$f":"IFERROR(IF(VLOOKUP(D789,#REF!,2,0)=\"O\",0,IF(VLOOKUP(D789,#REF!,2,0)=\"T\",1,0)),\"ERROR\")","v":"ERROR"},null,null,null,null,null,null,null,null,null,null,null,null,null,null,null,null,null,null,null,null,null,null,null,null,null,null,"410","218-1","410218-1",1]
[null,"471-State Conservation Commission","173-1 State Toxics Control Account-State",{"$f":"LEFT(ActiveFunds!$C777,5)","v":"173-1"},{"$f":"IFERROR(IF(VLOOKUP(D790,#REF!,2,0)=\"O\",0,IF(VLOOKUP(D790,#REF!,2,0)=\"T\",1,0)),\"ERROR\")","v":"ERROR"},null,null,null,null,null,null,null,null,null,null,null,null,null,null,null,null,null,null,null,null,null,null,null,null,null,null,"411","09E-1","41109E-1",1]
[null,"477-Dept of Fish and Wildlife","001-1 General Fund-State",{"$f":"LEFT(ActiveFunds!$C778,5)","v":"001-1"},{"$f":"IFERROR(IF(VLOOKUP(D791,#REF!,2,0)=\"O\",0,IF(VLOOKUP(D791,#REF!,2,0)=\"T\",1,0)),\"ERROR\")","v":"ERROR"},null,null,null,null,null,null,null,null,null,null,null,null,null,null,null,null,null,null,null,null,null,null,null,null,null,null,"411","106-1","411106-1",1]
[null,"477-Dept of Fish and Wildlife","001-2 General Fund-Federal",{"$f":"LEFT(ActiveFunds!$C779,5)","v":"001-2"},{"$f":"IFERROR(IF(VLOOKUP(D792,#REF!,2,0)=\"O\",0,IF(VLOOKUP(D792,#REF!,2,0)=\"T\",1,0)),\"ERROR\")","v":"ERROR"},null,null,null,null,null,null,null,null,null,null,null,null,null,null,null,null,null,null,null,null,null,null,null,null,null,null,"411","108-1","411108-1",1]
[null,"477-Dept of Fish and Wildlife","001-7 General Fund-Private/Local",{"$f":"LEFT(ActiveFunds!$C780,5)","v":"001-7"},{"$f":"IFERROR(IF(VLOOKUP(D793,#REF!,2,0)=\"O\",0,IF(VLOOKUP(D793,#REF!,2,0)=\"T\",1,0)),\"ERROR\")","v":"ERROR"},null,null,null,null,null,null,null,null,null,null,null,null,null,null,null,null,null,null,null,null,null,null,null,null,null,null,"411","108-2","411108-2",1]
[null,"477-Dept of Fish and Wildlife","01B-1 ORV & Non-Highway Vehicle Account-State",{"$f":"LEFT(ActiveFunds!$C781,5)","v":"01B-1"},{"$f":"IFERROR(IF(VLOOKUP(D794,#REF!,2,0)=\"O\",0,IF(VLOOKUP(D794,#REF!,2,0)=\"T\",1,0)),\"ERROR\")","v":"ERROR"},null,null,null,null,null,null,null,null,null,null,null,null,null,null,null,null,null,null,null,null,null,null,null,null,null,null,"411","11E-1","41111E-1",1]
[null,"477-Dept of Fish and Wildlife","02R-1 Aquatic Lands Enhancement Account-State",{"$f":"LEFT(ActiveFunds!$C782,5)","v":"02R-1"},{"$f":"IFERROR(IF(VLOOKUP(D795,#REF!,2,0)=\"O\",0,IF(VLOOKUP(D795,#REF!,2,0)=\"T\",1,0)),\"ERROR\")","v":"ERROR"},null,null,null,null,null,null,null,null,null,null,null,null,null,null,null,null,null,null,null,null,null,null,null,null,null,null,"411","11E-7","41111E-7",1]
[null,"477-Dept of Fish and Wildlife","04M-1 Recreational Fisheries Enhancement-State",{"$f":"LEFT(ActiveFunds!$C783,5)","v":"04M-1"},{"$f":"IFERROR(IF(VLOOKUP(D796,#REF!,2,0)=\"O\",0,IF(VLOOKUP(D796,#REF!,2,0)=\"T\",1,0)),\"ERROR\")","v":"ERROR"},null,null,null,null,null,null,null,null,null,null,null,null,null,null,null,null,null,null,null,null,null,null,null,null,null,null,"461","108-1","461108-1",1]
[null,"477-Dept of Fish and Wildlife","05H-1 Disaster Response Account-State",{"$f":"LEFT(ActiveFunds!$C784,5)","v":"05H-1"},{"$f":"IFERROR(IF(VLOOKUP(D797,#REF!,2,0)=\"O\",0,IF(VLOOKUP(D797,#REF!,2,0)=\"T\",1,0)),\"ERROR\")","v":"ERROR"},null,null,null,null,null,null,null,null,null,null,null,null,null,null,null,null,null,null,null,null,null,null,null,null,null,null,"465","108-1","465108-1",1]
[null,"477-Dept of Fish and Wildlife","071-1 Warm Water Game Fish Account-State",{"$f":"LEFT(ActiveFunds!$C785,5)","v":"071-1"},{"$f":"IFERROR(IF(VLOOKUP(D798,#REF!,2,0)=\"O\",0,IF(VLOOKUP(D798,#REF!,2,0)=\"T\",1,0)),\"ERROR\")","v":"ERROR"},null,null,null,null,null,null,null,null,null,null,null,null,null,null,null,null,null,null,null,null,null,null,null,null,null,null,"477","108-1","477108-1",1]
[null,"477-Dept of Fish and Wildlife","07V-6 Fish & Wildlife Enforcement Reward-Non-Appropriated",{"$f":"LEFT(ActiveFunds!$C786,5)","v":"07V-6"},{"$f":"IFERROR(IF(VLOOKUP(D799,#REF!,2,0)=\"O\",0,IF(VLOOKUP(D799,#REF!,2,0)=\"T\",1,0)),\"ERROR\")","v":"ERROR"},null,null,null,null,null,null,null,null,null,null,null,null,null,null,null,null,null,null,null,null,null,null,null,null,null,null,"495","108-1","495108-1",1]
[null,"477-Dept of Fish and Wildlife","098-1 East WA Pheasant Enhancement Acct-State",{"$f":"LEFT(ActiveFunds!$C787,5)","v":"098-1"},{"$f":"IFERROR(IF(VLOOKUP(D800,#REF!,2,0)=\"O\",0,IF(VLOOKUP(D800,#REF!,2,0)=\"T\",1,0)),\"ERROR\")","v":"ERROR"},null,null,null,null,null,null,null,null,null,null,null,null,null,null,null,null,null,null,null,null,null,null,null,null,null,null,"107","492-1","107492-1",0]
[null,"477-Dept of Fish and Wildlife","09J-6 WA Coast Crab Pot Buoy Tag Account-Non-Appropriated",{"$f":"LEFT(ActiveFunds!$C788,5)","v":"09J-6"},{"$f":"IFERROR(IF(VLOOKUP(D801,#REF!,2,0)=\"O\",0,IF(VLOOKUP(D801,#REF!,2,0)=\"T\",1,0)),\"ERROR\")","v":"ERROR"}]
[null,"477-Dept of Fish and Wildlife","09M-1 Aquatic Invasive Species Enf. Acct.-State",{"$f":"LEFT(ActiveFunds!$C789,5)","v":"09M-1"},{"$f":"IFERROR(IF(VLOOKUP(D802,#REF!,2,0)=\"O\",0,IF(VLOOKUP(D802,#REF!,2,0)=\"T\",1,0)),\"ERROR\")","v":"ERROR"}]
[null,"477-Dept of Fish and Wildlife","09N-1 Aquatic Invasive Sp Prevention Acct-State",{"$f":"LEFT(ActiveFunds!$C790,5)","v":"09N-1"},{"$f":"IFERROR(IF(VLOOKUP(D803,#REF!,2,0)=\"O\",0,IF(VLOOKUP(D803,#REF!,2,0)=\"T\",1,0)),\"ERROR\")","v":"ERROR"}]
[null,"477-Dept of Fish and Wildlife","104-1 State Wildlife Account-State",{"$f":"LEFT(ActiveFunds!$C791,5)","v":"104-1"},{"$f":"IFERROR(IF(VLOOKUP(D804,#REF!,2,0)=\"O\",0,IF(VLOOKUP(D804,#REF!,2,0)=\"T\",1,0)),\"ERROR\")","v":"ERROR"}]
[null,"477-Dept of Fish and Wildlife","108-1 Motor Vehicle Account-State",{"$f":"LEFT(ActiveFunds!$C792,5)","v":"108-1"},{"$f":"IFERROR(IF(VLOOKUP(D805,#REF!,2,0)=\"O\",0,IF(VLOOKUP(D805,#REF!,2,0)=\"T\",1,0)),\"ERROR\")","v":"ERROR"}]
[null,"477-Dept of Fish and Wildlife","110-1 Special Wildlife Account-State",{"$f":"LEFT(ActiveFunds!$C793,5)","v":"110-1"},{"$f":"IFERROR(IF(VLOOKUP(D806,#REF!,2,0)=\"O\",0,IF(VLOOKUP(D806,#REF!,2,0)=\"T\",1,0)),\"ERROR\")","v":"ERROR"}]
[null,"477-Dept of Fish and Wildlife","110-2 Special Wildlife Account-Federal",{"$f":"LEFT(ActiveFunds!$C794,5)","v":"110-2"},{"$f":"IFERROR(IF(VLOOKUP(D807,#REF!,2,0)=\"O\",0,IF(VLOOKUP(D807,#REF!,2,0)=\"T\",1,0)),\"ERROR\")","v":"ERROR"}]
[null,"477-Dept of Fish and Wildlife","110-7 Special Wildlife Account-Private/Local",{"$f":"LEFT(ActiveFunds!$C795,5)","v":"110-7"},{"$f":"IFERROR(IF(VLOOKUP(D808,#REF!,2,0)=\"O\",0,IF(VLOOKUP(D808,#REF!,2,0)=\"T\",1,0)),\"ERROR\")","v":"ERROR"}]
[null,"477-Dept of Fish and Wildlife","12G-6 Rockfish Research Account-Non-Appropriated",{"$f":"LEFT(ActiveFunds!$C796,5)","v":"12G-6"},{"$f":"IFERROR(IF(VLOOKUP(D809,#REF!,2,0)=\"O\",0,IF(VLOOKUP(D809,#REF!,2,0)=\"T\",1,0)),\"ERROR\")","v":"ERROR"}]
[null,"477-Dept of Fish and Wildlife","14A-1 Wildlife Rehabilitation Account-State",{"$f":"LEFT(ActiveFunds!$C797,5)","v":"14A-1"},{"$f":"IFERROR(IF(VLOOKUP(D810,#REF!,2,0)=\"O\",0,IF(VLOOKUP(D810,#REF!,2,0)=\"T\",1,0)),\"ERROR\")","v":"ERROR"}]
[null,"477-Dept of Fish and Wildlife","14B-1 Budget Stabilization Account-State",{"$f":"LEFT(ActiveFunds!$C798,5)","v":"14B-1"},{"$f":"IFERROR(IF(VLOOKUP(D811,#REF!,2,0)=\"O\",0,IF(VLOOKUP(D811,#REF!,2,0)=\"T\",1,0)),\"ERROR\")","v":"ERROR"}]
[null,"477-Dept of Fish and Wildlife","16H-6 Col Rvr Rec Salmon/Steelhead Endrs-Non-Appropriated",{"$f":"LEFT(ActiveFunds!$C799,5)","v":"16H-6"},{"$f":"IFERROR(IF(VLOOKUP(D812,#REF!,2,0)=\"O\",0,IF(VLOOKUP(D812,#REF!,2,0)=\"T\",1,0)),\"ERROR\")","v":"ERROR"}]
[null,"477-Dept of Fish and Wildlife","18L-1 Hydraulic Project Approval Account-State",{"$f":"LEFT(ActiveFunds!$C800,5)","v":"18L-1"},{"$f":"IFERROR(IF(VLOOKUP(D813,#REF!,2,0)=\"O\",0,IF(VLOOKUP(D813,#REF!,2,0)=\"T\",1,0)),\"ERROR\")","v":"ERROR"}]
[null,"477-Dept of Fish and Wildlife","19G-1 Environmental Legacy Stewardship-State",{"$f":"LEFT(ActiveFunds!$C801,5)","v":"19G-1"},{"$f":"IFERROR(IF(VLOOKUP(D814,#REF!,2,0)=\"O\",0,IF(VLOOKUP(D814,#REF!,2,0)=\"T\",1,0)),\"ERROR\")","v":"ERROR"}]
[null,"477-Dept of Fish and Wildlife","19W-6 Wolf-Livestock Conflict Account-Non-Appropriated",{"$f":"LEFT(ActiveFunds!$C802,5)","v":"19W-6"},{"$f":"IFERROR(IF(VLOOKUP(D815,#REF!,2,0)=\"O\",0,IF(VLOOKUP(D815,#REF!,2,0)=\"T\",1,0)),\"ERROR\")","v":"ERROR"}]
[null,"477-Dept of Fish and Wildlife","200-2 Regnl Fisheries Enh Salmonid Recov-Federal",{"$f":"LEFT(ActiveFunds!$C803,5)","v":"200-2"},{"$f":"IFERROR(IF(VLOOKUP(D816,#REF!,2,0)=\"O\",0,IF(VLOOKUP(D816,#REF!,2,0)=\"T\",1,0)),\"ERROR\")","v":"ERROR"}]
[null,"477-Dept of Fish and Wildlife","209-6 Regional Fisheries Enhance Group-Non-Appropriated",{"$f":"LEFT(ActiveFunds!$C804,5)","v":"209-6"},{"$f":"IFERROR(IF(VLOOKUP(D817,#REF!,2,0)=\"O\",0,IF(VLOOKUP(D817,#REF!,2,0)=\"T\",1,0)),\"ERROR\")","v":"ERROR"}]
[null,"477-Dept of Fish and Wildlife","217-1 Oil Spill Prevention Account-State",{"$f":"LEFT(ActiveFunds!$C805,5)","v":"217-1"},{"$f":"IFERROR(IF(VLOOKUP(D818,#REF!,2,0)=\"O\",0,IF(VLOOKUP(D818,#REF!,2,0)=\"T\",1,0)),\"ERROR\")","v":"ERROR"}]
[null,"477-Dept of Fish and Wildlife","259-6 Coastal Crab Account-Non-Appropriated",{"$f":"LEFT(ActiveFunds!$C806,5)","v":"259-6"},{"$f":"IFERROR(IF(VLOOKUP(D819,#REF!,2,0)=\"O\",0,IF(VLOOKUP(D819,#REF!,2,0)=\"T\",1,0)),\"ERROR\")","v":"ERROR"}]
[null,"477-Dept of Fish and Wildlife","320-6 Puget Sound Crab Pot Buoy Tag Acct-Non-Appropriated",{"$f":"LEFT(ActiveFunds!$C807,5)","v":"320-6"},{"$f":"IFERROR(IF(VLOOKUP(D820,#REF!,2,0)=\"O\",0,IF(VLOOKUP(D820,#REF!,2,0)=\"T\",1,0)),\"ERROR\")","v":"ERROR"}]
[null,"477-Dept of Fish and Wildlife","444-6 Fish & Wildlife Equip Revolv Acct-Non-Appropriated",{"$f":"LEFT(ActiveFunds!$C808,5)","v":"444-6"},{"$f":"IFERROR(IF(VLOOKUP(D821,#REF!,2,0)=\"O\",0,IF(VLOOKUP(D821,#REF!,2,0)=\"T\",1,0)),\"ERROR\")","v":"ERROR"}]
[null,"477-Dept of Fish and Wildlife","447-6 Info Tech Invest Rev Acct-Non-Appropriated",{"$f":"LEFT(ActiveFunds!$C809,5)","v":"447-6"},{"$f":"IFERROR(IF(VLOOKUP(D822,#REF!,2,0)=\"O\",0,IF(VLOOKUP(D822,#REF!,2,0)=\"T\",1,0)),\"ERROR\")","v":"ERROR"}]
[null,"477-Dept of Fish and Wildlife","507-1 Oyster Reserve Land Account-State",{"$f":"LEFT(ActiveFunds!$C810,5)","v":"507-1"},{"$f":"IFERROR(IF(VLOOKUP(D823,#REF!,2,0)=\"O\",0,IF(VLOOKUP(D823,#REF!,2,0)=\"T\",1,0)),\"ERROR\")","v":"ERROR"}]
[null,"478-Puget Sound Partnership","001-1 General Fund-State",{"$f":"LEFT(ActiveFunds!$C811,5)","v":"001-1"},{"$f":"IFERROR(IF(VLOOKUP(D824,#REF!,2,0)=\"O\",0,IF(VLOOKUP(D824,#REF!,2,0)=\"T\",1,0)),\"ERROR\")","v":"ERROR"}]
[null,"478-Puget Sound Partnership","001-2 General Fund-Federal",{"$f":"LEFT(ActiveFunds!$C812,5)","v":"001-2"},{"$f":"IFERROR(IF(VLOOKUP(D825,#REF!,2,0)=\"O\",0,IF(VLOOKUP(D825,#REF!,2,0)=\"T\",1,0)),\"ERROR\")","v":"ERROR"}]
[null,"478-Puget Sound Partnership","001-3 General Fund-Federal Unanticipated",{"$f":"LEFT(ActiveFunds!$C813,5)","v":"001-3"},{"$f":"IFERROR(IF(VLOOKUP(D826,#REF!,2,0)=\"O\",0,IF(VLOOKUP(D826,#REF!,2,0)=\"T\",1,0)),\"ERROR\")","v":"ERROR"}]
[null,"478-Puget Sound Partnership","02R-1 Aquatic Lands Enhancement Account-State",{"$f":"LEFT(ActiveFunds!$C814,5)","v":"02R-1"},{"$f":"IFERROR(IF(VLOOKUP(D827,#REF!,2,0)=\"O\",0,IF(VLOOKUP(D827,#REF!,2,0)=\"T\",1,0)),\"ERROR\")","v":"ERROR"}]
[null,"478-Puget Sound Partnership","03K-6 Industrial Insurance Premium Refund-Non-Appropriated",{"$f":"LEFT(ActiveFunds!$C815,5)","v":"03K-6"},{"$f":"IFERROR(IF(VLOOKUP(D828,#REF!,2,0)=\"O\",0,IF(VLOOKUP(D828,#REF!,2,0)=\"T\",1,0)),\"ERROR\")","v":"ERROR"}]
[null,"478-Puget Sound Partnership","173-1 State Toxics Control Account-State",{"$f":"LEFT(ActiveFunds!$C816,5)","v":"173-1"},{"$f":"IFERROR(IF(VLOOKUP(D829,#REF!,2,0)=\"O\",0,IF(VLOOKUP(D829,#REF!,2,0)=\"T\",1,0)),\"ERROR\")","v":"ERROR"}]
[null,"490-Department of Natural Resources","001-1 General Fund-State",{"$f":"LEFT(ActiveFunds!$C817,5)","v":"001-1"},{"$f":"IFERROR(IF(VLOOKUP(D830,#REF!,2,0)=\"O\",0,IF(VLOOKUP(D830,#REF!,2,0)=\"T\",1,0)),\"ERROR\")","v":"ERROR"}]
[null,"490-Department of Natural Resources","001-2 General Fund-Federal",{"$f":"LEFT(ActiveFunds!$C818,5)","v":"001-2"},{"$f":"IFERROR(IF(VLOOKUP(D831,#REF!,2,0)=\"O\",0,IF(VLOOKUP(D831,#REF!,2,0)=\"T\",1,0)),\"ERROR\")","v":"ERROR"}]
[null,"490-Department of Natural Resources","001-7 General Fund-Private/Local",{"$f":"LEFT(ActiveFunds!$C819,5)","v":"001-7"},{"$f":"IFERROR(IF(VLOOKUP(D832,#REF!,2,0)=\"O\",0,IF(VLOOKUP(D832,#REF!,2,0)=\"T\",1,0)),\"ERROR\")","v":"ERROR"}]
[null,"490-Department of Natural Resources","014-1 Forest Development Account-State",{"$f":"LEFT(ActiveFunds!$C820,5)","v":"014-1"},{"$f":"IFERROR(IF(VLOOKUP(D833,#REF!,2,0)=\"O\",0,IF(VLOOKUP(D833,#REF!,2,0)=\"T\",1,0)),\"ERROR\")","v":"ERROR"}]
[null,"490-Department of Natural Resources","01B-1 ORV & Non-Highway Vehicle Account-State",{"$f":"LEFT(ActiveFunds!$C821,5)","v":"01B-1"},{"$f":"IFERROR(IF(VLOOKUP(D834,#REF!,2,0)=\"O\",0,IF(VLOOKUP(D834,#REF!,2,0)=\"T\",1,0)),\"ERROR\")","v":"ERROR"}]
[null,"490-Department of Natural Resources","02A-1 Surveys and Maps Account-State",{"$f":"LEFT(ActiveFunds!$C822,5)","v":"02A-1"},{"$f":"IFERROR(IF(VLOOKUP(D835,#REF!,2,0)=\"O\",0,IF(VLOOKUP(D835,#REF!,2,0)=\"T\",1,0)),\"ERROR\")","v":"ERROR"}]
[null,"490-Department of Natural Resources","02R-1 Aquatic Lands Enhancement Account-State",{"$f":"LEFT(ActiveFunds!$C823,5)","v":"02R-1"},{"$f":"IFERROR(IF(VLOOKUP(D836,#REF!,2,0)=\"O\",0,IF(VLOOKUP(D836,#REF!,2,0)=\"T\",1,0)),\"ERROR\")","v":"ERROR"}]
[null,"490-Department of Natural Resources","030-6 Landowner Contng Forest Fire Supp-Non-Appropriated",{"$f":"LEFT(ActiveFunds!$C824,5)","v":"030-6"},{"$f":"IFERROR(IF(VLOOKUP(D837,#REF!,2,0)=\"O\",0,IF(VLOOKUP(D837,#REF!,2,0)=\"T\",1,0)),\"ERROR\")","v":"ERROR"}]
[null,"490-Department of Natural Resources","041-1 Resources Management Cost Account-State",{"$f":"LEFT(ActiveFunds!$C825,5)","v":"041-1"},{"$f":"IFERROR(IF(VLOOKUP(D838,#REF!,2,0)=\"O\",0,IF(VLOOKUP(D838,#REF!,2,0)=\"T\",1,0)),\"ERROR\")","v":"ERROR"}]
[null,"490-Department of Natural Resources","04H-1 Surface Mining Reclamation Account-State",{"$f":"LEFT(ActiveFunds!$C826,5)","v":"04H-1"},{"$f":"IFERROR(IF(VLOOKUP(D839,#REF!,2,0)=\"O\",0,IF(VLOOKUP(D839,#REF!,2,0)=\"T\",1,0)),\"ERROR\")","v":"ERROR"}]
[null,"490-Department of Natural Resources","05H-1 Disaster Response Account-State",{"$f":"LEFT(ActiveFunds!$C827,5)","v":"05H-1"},{"$f":"IFERROR(IF(VLOOKUP(D840,#REF!,2,0)=\"O\",0,IF(VLOOKUP(D840,#REF!,2,0)=\"T\",1,0)),\"ERROR\")","v":"ERROR"}]
[null,"490-Department of Natural Resources","07E-6 Contract Harvesting Revolving Acct-Non-Appropriated",{"$f":"LEFT(ActiveFunds!$C828,5)","v":"07E-6"},{"$f":"IFERROR(IF(VLOOKUP(D841,#REF!,2,0)=\"O\",0,IF(VLOOKUP(D841,#REF!,2,0)=\"T\",1,0)),\"ERROR\")","v":"ERROR"}]
[null,"490-Department of Natural Resources","087-6 Park Land Trust Revolving Account-Non-Appropriated",{"$f":"LEFT(ActiveFunds!$C829,5)","v":"087-6"},{"$f":"IFERROR(IF(VLOOKUP(D842,#REF!,2,0)=\"O\",0,IF(VLOOKUP(D842,#REF!,2,0)=\"T\",1,0)),\"ERROR\")","v":"ERROR"}]
[null,"490-Department of Natural Resources","11H-1 Forest and Fish Support Account-State",{"$f":"LEFT(ActiveFunds!$C830,5)","v":"11H-1"},{"$f":"IFERROR(IF(VLOOKUP(D843,#REF!,2,0)=\"O\",0,IF(VLOOKUP(D843,#REF!,2,0)=\"T\",1,0)),\"ERROR\")","v":"ERROR"}]
[null,"490-Department of Natural Resources","14B-1 Budget Stabilization Account-State",{"$f":"LEFT(ActiveFunds!$C831,5)","v":"14B-1"},{"$f":"IFERROR(IF(VLOOKUP(D844,#REF!,2,0)=\"O\",0,IF(VLOOKUP(D844,#REF!,2,0)=\"T\",1,0)),\"ERROR\")","v":"ERROR"}]
[null,"490-Department of Natural Resources","158-1 Aquatic Land Dredged Mat Disp Site-State",{"$f":"LEFT(ActiveFunds!$C832,5)","v":"158-1"},{"$f":"IFERROR(IF(VLOOKUP(D845,#REF!,2,0)=\"O\",0,IF(VLOOKUP(D845,#REF!,2,0)=\"T\",1,0)),\"ERROR\")","v":"ERROR"}]
[null,"490-Department of Natural Resources","167-1 Nat Res Conserv Areas Stewardship-State",{"$f":"LEFT(ActiveFunds!$C833,5)","v":"167-1"},{"$f":"IFERROR(IF(VLOOKUP(D846,#REF!,2,0)=\"O\",0,IF(VLOOKUP(D846,#REF!,2,0)=\"T\",1,0)),\"ERROR\")","v":"ERROR"}]
[null,"490-Department of Natural Resources","16P-1 Marine Resources Stewardship Trust-State",{"$f":"LEFT(ActiveFunds!$C834,5)","v":"16P-1"},{"$f":"IFERROR(IF(VLOOKUP(D847,#REF!,2,0)=\"O\",0,IF(VLOOKUP(D847,#REF!,2,0)=\"T\",1,0)),\"ERROR\")","v":"ERROR"}]
[null,"490-Department of Natural Resources","173-1 State Toxics Control Account-State",{"$f":"LEFT(ActiveFunds!$C835,5)","v":"173-1"},{"$f":"IFERROR(IF(VLOOKUP(D848,#REF!,2,0)=\"O\",0,IF(VLOOKUP(D848,#REF!,2,0)=\"T\",1,0)),\"ERROR\")","v":"ERROR"}]
[null,"490-Department of Natural Resources","190-6 Forest Fire Protection Assessment-Non-Appropriated",{"$f":"LEFT(ActiveFunds!$C836,5)","v":"190-6"},{"$f":"IFERROR(IF(VLOOKUP(D849,#REF!,2,0)=\"O\",0,IF(VLOOKUP(D849,#REF!,2,0)=\"T\",1,0)),\"ERROR\")","v":"ERROR"}]
[null,"490-Department of Natural Resources","193-6 State Forest Nursery Revolving Acct-Non-Appropriated",{"$f":"LEFT(ActiveFunds!$C837,5)","v":"193-6"},{"$f":"IFERROR(IF(VLOOKUP(D850,#REF!,2,0)=\"O\",0,IF(VLOOKUP(D850,#REF!,2,0)=\"T\",1,0)),\"ERROR\")","v":"ERROR"}]
[null,"490-Department of Natural Resources","198-6 Access Road Revolving Account-Non-Appropriated",{"$f":"LEFT(ActiveFunds!$C838,5)","v":"198-6"},{"$f":"IFERROR(IF(VLOOKUP(D851,#REF!,2,0)=\"O\",0,IF(VLOOKUP(D851,#REF!,2,0)=\"T\",1,0)),\"ERROR\")","v":"ERROR"}]
[null,"490-Department of Natural Resources","19C-1 Forest Practices Application Acct-State",{"$f":"LEFT(ActiveFunds!$C839,5)","v":"19C-1"},{"$f":"IFERROR(IF(VLOOKUP(D852,#REF!,2,0)=\"O\",0,IF(VLOOKUP(D852,#REF!,2,0)=\"T\",1,0)),\"ERROR\")","v":"ERROR"}]
[null,"490-Department of Natural Resources","19G-1 Environmental Legacy Stewardship-State",{"$f":"LEFT(ActiveFunds!$C840,5)","v":"19G-1"},{"$f":"IFERROR(IF(VLOOKUP(D853,#REF!,2,0)=\"O\",0,IF(VLOOKUP(D853,#REF!,2,0)=\"T\",1,0)),\"ERROR\")","v":"ERROR"}]
[null,"490-Department of Natural Resources","216-1 Air Pollution Control Account-State",{"$f":"LEFT(ActiveFunds!$C841,5)","v":"216-1"},{"$f":"IFERROR(IF(VLOOKUP(D854,#REF!,2,0)=\"O\",0,IF(VLOOKUP(D854,#REF!,2,0)=\"T\",1,0)),\"ERROR\")","v":"ERROR"}]
[null,"490-Department of Natural Resources","268-1 NOVA Program Account-State",{"$f":"LEFT(ActiveFunds!$C842,5)","v":"268-1"},{"$f":"IFERROR(IF(VLOOKUP(D855,#REF!,2,0)=\"O\",0,IF(VLOOKUP(D855,#REF!,2,0)=\"T\",1,0)),\"ERROR\")","v":"ERROR"}]
[null,"490-Department of Natural Resources","411-6 Natural Resources Equipment Account-Non-Appropriated",{"$f":"LEFT(ActiveFunds!$C843,5)","v":"411-6"},{"$f":"IFERROR(IF(VLOOKUP(D856,#REF!,2,0)=\"O\",0,IF(VLOOKUP(D856,#REF!,2,0)=\"T\",1,0)),\"ERROR\")","v":"ERROR"}]
[null,"490-Department of Natural Resources","513-1 Derelict Vessel Removal Account-State",{"$f":"LEFT(ActiveFunds!$C844,5)","v":"513-1"},{"$f":"IFERROR(IF(VLOOKUP(D857,#REF!,2,0)=\"O\",0,IF(VLOOKUP(D857,#REF!,2,0)=\"T\",1,0)),\"ERROR\")","v":"ERROR"}]
[null,"490-Department of Natural Resources","566-1 Community Forest Trust Account-State",{"$f":"LEFT(ActiveFunds!$C845,5)","v":"566-1"},{"$f":"IFERROR(IF(VLOOKUP(D858,#REF!,2,0)=\"O\",0,IF(VLOOKUP(D858,#REF!,2,0)=\"T\",1,0)),\"ERROR\")","v":"ERROR"}]
[null,"490-Department of Natural Resources","830-1 Agricultural Coll Trust Mgmt Acct-State",{"$f":"LEFT(ActiveFunds!$C846,5)","v":"830-1"},{"$f":"IFERROR(IF(VLOOKUP(D859,#REF!,2,0)=\"O\",0,IF(VLOOKUP(D859,#REF!,2,0)=\"T\",1,0)),\"ERROR\")","v":"ERROR"}]
[null,"495-Department of Agriculture","001-1 General Fund-State",{"$f":"LEFT(ActiveFunds!$C847,5)","v":"001-1"},{"$f":"IFERROR(IF(VLOOKUP(D860,#REF!,2,0)=\"O\",0,IF(VLOOKUP(D860,#REF!,2,0)=\"T\",1,0)),\"ERROR\")","v":"ERROR"}]
[null,"495-Department of Agriculture","001-2 General Fund-Federal",{"$f":"LEFT(ActiveFunds!$C848,5)","v":"001-2"},{"$f":"IFERROR(IF(VLOOKUP(D861,#REF!,2,0)=\"O\",0,IF(VLOOKUP(D861,#REF!,2,0)=\"T\",1,0)),\"ERROR\")","v":"ERROR"}]
[null,"495-Department of Agriculture","001-7 General Fund-Private/Local",{"$f":"LEFT(ActiveFunds!$C849,5)","v":"001-7"},{"$f":"IFERROR(IF(VLOOKUP(D862,#REF!,2,0)=\"O\",0,IF(VLOOKUP(D862,#REF!,2,0)=\"T\",1,0)),\"ERROR\")","v":"ERROR"}]
[null,"495-Department of Agriculture","02R-1 Aquatic Lands Enhancement Account-State",{"$f":"LEFT(ActiveFunds!$C850,5)","v":"02R-1"},{"$f":"IFERROR(IF(VLOOKUP(D863,#REF!,2,0)=\"O\",0,IF(VLOOKUP(D863,#REF!,2,0)=\"T\",1,0)),\"ERROR\")","v":"ERROR"}]
[null,"495-Department of Agriculture","03K-6 Industrial Insurance Premium Refund-Non-Appropriated",{"$f":"LEFT(ActiveFunds!$C851,5)","v":"03K-6"},{"$f":"IFERROR(IF(VLOOKUP(D864,#REF!,2,0)=\"O\",0,IF(VLOOKUP(D864,#REF!,2,0)=\"T\",1,0)),\"ERROR\")","v":"ERROR"}]
[null,"495-Department of Agriculture","108-1 Motor Vehicle Account-State",{"$f":"LEFT(ActiveFunds!$C852,5)","v":"108-1"},{"$f":"IFERROR(IF(VLOOKUP(D865,#REF!,2,0)=\"O\",0,IF(VLOOKUP(D865,#REF!,2,0)=\"T\",1,0)),\"ERROR\")","v":"ERROR"}]
[null,"495-Department of Agriculture","126-6 Agricultural Local Account-Non-Appropriated",{"$f":"LEFT(ActiveFunds!$C853,5)","v":"126-6"},{"$f":"IFERROR(IF(VLOOKUP(D866,#REF!,2,0)=\"O\",0,IF(VLOOKUP(D866,#REF!,2,0)=\"T\",1,0)),\"ERROR\")","v":"ERROR"}]
[null,"495-Department of Agriculture","128-6 Grain Inspection Revolving Acct-Non-Appropriated",{"$f":"LEFT(ActiveFunds!$C854,5)","v":"128-6"},{"$f":"IFERROR(IF(VLOOKUP(D867,#REF!,2,0)=\"O\",0,IF(VLOOKUP(D867,#REF!,2,0)=\"T\",1,0)),\"ERROR\")","v":"ERROR"}]
[null,"495-Department of Agriculture","131-6 Fair Account-Non-Appropriated",{"$f":"LEFT(ActiveFunds!$C855,5)","v":"131-6"},{"$f":"IFERROR(IF(VLOOKUP(D868,#REF!,2,0)=\"O\",0,IF(VLOOKUP(D868,#REF!,2,0)=\"T\",1,0)),\"ERROR\")","v":"ERROR"}]
[null,"495-Department of Agriculture","173-1 State Toxics Control Account-State",{"$f":"LEFT(ActiveFunds!$C856,5)","v":"173-1"},{"$f":"IFERROR(IF(VLOOKUP(D869,#REF!,2,0)=\"O\",0,IF(VLOOKUP(D869,#REF!,2,0)=\"T\",1,0)),\"ERROR\")","v":"ERROR"}]
[null,"495-Department of Agriculture","176-1 Water Quality Permit Account-State",{"$f":"LEFT(ActiveFunds!$C857,5)","v":"176-1"},{"$f":"IFERROR(IF(VLOOKUP(D870,#REF!,2,0)=\"O\",0,IF(VLOOKUP(D870,#REF!,2,0)=\"T\",1,0)),\"ERROR\")","v":"ERROR"}]
[null,"495-Department of Agriculture","516-6 Fruit and Vegetable Inspection Acct-Non-Appropriated",{"$f":"LEFT(ActiveFunds!$C858,5)","v":"516-6"},{"$f":"IFERROR(IF(VLOOKUP(D871,#REF!,2,0)=\"O\",0,IF(VLOOKUP(D871,#REF!,2,0)=\"T\",1,0)),\"ERROR\")","v":"ERROR"}]
[null,"495-Department of Agriculture","687-6 Rural Rehabilitation Account-Non-Appropriated",{"$f":"LEFT(ActiveFunds!$C859,5)","v":"687-6"},{"$f":"IFERROR(IF(VLOOKUP(D872,#REF!,2,0)=\"O\",0,IF(VLOOKUP(D872,#REF!,2,0)=\"T\",1,0)),\"ERROR\")","v":"ERROR"}]
[null,"495-Department of Agriculture","823-6 Livestock Nutrient Management Acct-Non-Appropriated",{"$f":"LEFT(ActiveFunds!$C860,5)","v":"823-6"},{"$f":"IFERROR(IF(VLOOKUP(D873,#REF!,2,0)=\"O\",0,IF(VLOOKUP(D873,#REF!,2,0)=\"T\",1,0)),\"ERROR\")","v":"ERROR"}]
[null,"540-Employment Security Department","001-2 General Fund-Federal",{"$f":"LEFT(ActiveFunds!$C861,5)","v":"001-2"},{"$f":"IFERROR(IF(VLOOKUP(D874,#REF!,2,0)=\"O\",0,IF(VLOOKUP(D874,#REF!,2,0)=\"T\",1,0)),\"ERROR\")","v":"ERROR"}]
[null,"540-Employment Security Department","001-7 General Fund-Private/Local",{"$f":"LEFT(ActiveFunds!$C862,5)","v":"001-7"},{"$f":"IFERROR(IF(VLOOKUP(D875,#REF!,2,0)=\"O\",0,IF(VLOOKUP(D875,#REF!,2,0)=\"T\",1,0)),\"ERROR\")","v":"ERROR"}]
[null,"540-Employment Security Department","119-2 Unemployment Compensation Admin-Federal",{"$f":"LEFT(ActiveFunds!$C863,5)","v":"119-2"},{"$f":"IFERROR(IF(VLOOKUP(D876,#REF!,2,0)=\"O\",0,IF(VLOOKUP(D876,#REF!,2,0)=\"T\",1,0)),\"ERROR\")","v":"ERROR"}]
[null,"540-Employment Security Department","120-1 Administrative Contingency Account-State",{"$f":"LEFT(ActiveFunds!$C864,5)","v":"120-1"},{"$f":"IFERROR(IF(VLOOKUP(D877,#REF!,2,0)=\"O\",0,IF(VLOOKUP(D877,#REF!,2,0)=\"T\",1,0)),\"ERROR\")","v":"ERROR"}]
[null,"540-Employment Security Department","134-1 Employment Services Administrative-State",{"$f":"LEFT(ActiveFunds!$C865,5)","v":"134-1"},{"$f":"IFERROR(IF(VLOOKUP(D878,#REF!,2,0)=\"O\",0,IF(VLOOKUP(D878,#REF!,2,0)=\"T\",1,0)),\"ERROR\")","v":"ERROR"}]
[null,"540-Employment Security Department","16L-6 Accessible Communities Account-Non-Appropriated",{"$f":"LEFT(ActiveFunds!$C866,5)","v":"16L-6"},{"$f":"IFERROR(IF(VLOOKUP(D879,#REF!,2,0)=\"O\",0,IF(VLOOKUP(D879,#REF!,2,0)=\"T\",1,0)),\"ERROR\")","v":"ERROR"}]
[null,"540-Employment Security Department","620-6 Unemployment Compensation Account-Non-Appropriated",{"$f":"LEFT(ActiveFunds!$C867,5)","v":"620-6"},{"$f":"IFERROR(IF(VLOOKUP(D880,#REF!,2,0)=\"O\",0,IF(VLOOKUP(D880,#REF!,2,0)=\"T\",1,0)),\"ERROR\")","v":"ERROR"}]
[null,"540-Employment Security Department","622-6 Unemployment Comp Fed Emp Ben Pmt-Non-Appropriated",{"$f":"LEFT(ActiveFunds!$C868,5)","v":"622-6"},{"$f":"IFERROR(IF(VLOOKUP(D881,#REF!,2,0)=\"O\",0,IF(VLOOKUP(D881,#REF!,2,0)=\"T\",1,0)),\"ERROR\")","v":"ERROR"}]
[null,"699-Community/Technical College System","001-1 General Fund-State",{"$f":"LEFT(ActiveFunds!$C869,5)","v":"001-1"},{"$f":"IFERROR(IF(VLOOKUP(D882,#REF!,2,0)=\"O\",0,IF(VLOOKUP(D882,#REF!,2,0)=\"T\",1,0)),\"ERROR\")","v":"ERROR"}]
[null,"699-Community/Technical College System","060-1 Comm/Tech Col Capital Projects Acct-State",{"$f":"LEFT(ActiveFunds!$C870,5)","v":"060-1"},{"$f":"IFERROR(IF(VLOOKUP(D883,#REF!,2,0)=\"O\",0,IF(VLOOKUP(D883,#REF!,2,0)=\"T\",1,0)),\"ERROR\")","v":"ERROR"}]
[null,"699-Community/Technical College System","08A-1 Education Legacy Trust Account-State",{"$f":"LEFT(ActiveFunds!$C871,5)","v":"08A-1"},{"$f":"IFERROR(IF(VLOOKUP(D884,#REF!,2,0)=\"O\",0,IF(VLOOKUP(D884,#REF!,2,0)=\"T\",1,0)),\"ERROR\")","v":"ERROR"}]
[null,"699-Community/Technical College System","11A-6 Employment Training Finance Account-Non-Appropriated",{"$f":"LEFT(ActiveFunds!$C872,5)","v":"11A-6"},{"$f":"IFERROR(IF(VLOOKUP(D885,#REF!,2,0)=\"O\",0,IF(VLOOKUP(D885,#REF!,2,0)=\"T\",1,0)),\"ERROR\")","v":"ERROR"}]
[null,"699-Community/Technical College System","145-6 Inst of Hi Ed-Grants/Contracts Acct-Non-Appropriated",{"$f":"LEFT(ActiveFunds!$C873,5)","v":"145-6"},{"$f":"IFERROR(IF(VLOOKUP(D886,#REF!,2,0)=\"O\",0,IF(VLOOKUP(D886,#REF!,2,0)=\"T\",1,0)),\"ERROR\")","v":"ERROR"}]
[null,"699-Community/Technical College System","148-6 Inst of Hi Ed-Dedicated Local Acct-Non-Appropriated",{"$f":"LEFT(ActiveFunds!$C874,5)","v":"148-6"},{"$f":"IFERROR(IF(VLOOKUP(D887,#REF!,2,0)=\"O\",0,IF(VLOOKUP(D887,#REF!,2,0)=\"T\",1,0)),\"ERROR\")","v":"ERROR"}]
[null,"699-Community/Technical College System","149-6 Inst of Hi Ed-Operating Fees Acct-Non-Appropriated",{"$f":"LEFT(ActiveFunds!$C875,5)","v":"149-6"},{"$f":"IFERROR(IF(VLOOKUP(D888,#REF!,2,0)=\"O\",0,IF(VLOOKUP(D888,#REF!,2,0)=\"T\",1,0)),\"ERROR\")","v":"ERROR"}]
[null,"699-Community/Technical College System","253-1 Education Construction Account-State",{"$f":"LEFT(ActiveFunds!$C876,5)","v":"253-1"},{"$f":"IFERROR(IF(VLOOKUP(D889,#REF!,2,0)=\"O\",0,IF(VLOOKUP(D889,#REF!,2,0)=\"T\",1,0)),\"ERROR\")","v":"ERROR"}]
[null,"699-Community/Technical College System","440-6 Inst of Hi Ed-Stores Account-Non-Appropriated",{"$f":"LEFT(ActiveFunds!$C877,5)","v":"440-6"},{"$f":"IFERROR(IF(VLOOKUP(D890,#REF!,2,0)=\"O\",0,IF(VLOOKUP(D890,#REF!,2,0)=\"T\",1,0)),\"ERROR\")","v":"ERROR"}]
[null,"699-Community/Technical College System","443-6 Inst of Hi Ed-Data Processing Acct-Non-Appropriated",{"$f":"LEFT(ActiveFunds!$C878,5)","v":"443-6"},{"$f":"IFERROR(IF(VLOOKUP(D891,#REF!,2,0)=\"O\",0,IF(VLOOKUP(D891,#REF!,2,0)=\"T\",1,0)),\"ERROR\")","v":"ERROR"}]
[null,"699-Community/Technical College System","448-6 Inst of Hi Ed-Printing Account-Non-Appropriated",{"$f":"LEFT(ActiveFunds!$C879,5)","v":"448-6"},{"$f":"IFERROR(IF(VLOOKUP(D892,#REF!,2,0)=\"O\",0,IF(VLOOKUP(D892,#REF!,2,0)=\"T\",1,0)),\"ERROR\")","v":"ERROR"}]
[null,"699-Community/Technical College System","450-6 Inst of Hi Ed-Other Facilities Acct-Non-Appropriated",{"$f":"LEFT(ActiveFunds!$C880,5)","v":"450-6"}]
[null,"699-Community/Technical College System","460-6 Inst of Hi Ed-Motor Pool Account-Non-Appropriated",{"$f":"LEFT(ActiveFunds!$C881,5)","v":"460-6"}]
[null,"699-Community/Technical College System","522-6 Inst of Hi Ed-Associated Students'-Non-Appropriated",{"$f":"LEFT(ActiveFunds!$C882,5)","v":"522-6"}]
[null,"699-Community/Technical College System","524-6 Inst of Hi Ed-Bookstore Account-Non-Appropriated",{"$f":"LEFT(ActiveFunds!$C883,5)","v":"524-6"}]
[null,"699-Community/Technical College System","528-6 Inst of Hi Ed-Parking Account-Non-Appropriated",{"$f":"LEFT(ActiveFunds!$C884,5)","v":"528-6"}]
[null,"699-Community/Technical College System","561-6 Comm/Tech College Innovation Accoun-Non-Appropriated",{"$f":"LEFT(ActiveFunds!$C885,5)","v":"561-6"}]
[null,"699-Community/Technical College System","569-6 Inst of Hi Ed-Food Services Account-Non-Appropriated",{"$f":"LEFT(ActiveFunds!$C886,5)","v":"569-6"}]
[null,"699-Community/Technical College System","570-6 Inst of Hi Ed-Other Enterprises-Non-Appropriated",{"$f":"LEFT(ActiveFunds!$C887,5)","v":"570-6"}]
[null,"699-Community/Technical College System","573-6 Inst of Hi Ed-Housing & Food Acct-Non-Appropriated",{"$f":"LEFT(ActiveFunds!$C888,5)","v":"573-6"}]
[null,"699-Community/Technical College System","846-6 Grant-In-Aid Scholarship/Fellowship-Non-Appropriated",{"$f":"LEFT(ActiveFunds!$C889,5)","v":"846-6"}]
[null,"699-Community/Technical College System","849-6 Inst of Hi Ed-Student Loan Account-Non-Appropriated",{"$f":"LEFT(ActiveFunds!$C890,5)","v":"849-6"}]
[null,"699-Community/Technical College System","850-6 Inst of Hi Ed-Work Study Account-Non-Appropriated",{"$f":"LEFT(ActiveFunds!$C891,5)","v":"850-6"}]
[null,"699-Community/Technical College System","859-6 Inst of Hi Ed-Endowment Local Acct-Non-Appropriated",{"$f":"LEFT(ActiveFunds!$C892,5)","v":"859-6"}]
[null,"699-Community/Technical College System","860-6 Inst of Hi Ed-Long Term Loan Acct-Non-Appropriated",{"$f":"LEFT(ActiveFunds!$C893,5)","v":"860-6"}]