{"text_format":"1","workbook":"xlsx","n_sheets":4,"sheets":["Information","FundSplits","FundSplitsDB","ActiveFunds"],"not_rendered":{"charts":0,"images":0,"macros":1,"external_links":0,"defined_names":87,"comments":1,"pivot_tables":0},"unopened":[],"bounds":{"document_bytes":16777216,"sheet_cells":100000,"rows_first":2000,"rows_last":500,"rows_between":2000,"halvings":0,"cell_chars":16384,"cell_head_chars":4096},"cells_cut":0,"cells_raw":0,"read":"whole","date_system":"1900"}

{"sheet":"Information","index":0,"n_rows":14,"n_cols":3,"rows_kept":14,"cut":false,"hidden":false,"merged":[]}
[]
[null,"2019-21 Central Service Fund Splits "]
[null,"Information and Instructions"]
[]
[1,"Please contact Bryan Way (OFM) if you need help with adding a new fund source, need help, or have questions.","Bryan Way (OFM)"]
["2.      "," This worksheet is dependent on macros, so if you receive a warning at the top of this worksheet, please click “enable.”"]
["3.       ","Select the worksheet titled “FundSplits.”  "]
["4.       ","To update the worksheet for your agency, simply click on the drop box in cell F3, scroll down to your agency number/name, highlight the agency name/number with your mouse, and then click on the that agency name using your left mouse button."]
["5.        ","The worksheet should have now show your agency’s name and, beginning in row 10, the various fund sources used in the 2019-21 budget for CFL.  You will be able to delete or clear any row starting at row 10 and below. "]
["6.       ","To add or edit a new fund source or program, simply click on the handle bar on the right side of the cell you wish to edit.  Please note that only the existing fund sources that apply to your agency are available on these drop downs.  "]
["7.       ","Next you will need to review/update the percentage of that fund source for each of the various central service model fees beginning in columns J through S.  "]
["8.      ","Program and Subprogram detail is only needed for certain agencies.  The drop down will display a blank if the agency does not need program/subprogram detail."]
["9.       ","Once the worksheet looks ok to you and you have made your changes, click on the “Save/Update\" button so that your changes are recorded.  "]
["10.   ","Email your file to your OFM budget analyst and Bryan Way (OFM) with a brief explanation of any changes you made.","OFM budget analyst"]

{"sheet":"FundSplits","index":1,"n_rows":352,"n_cols":36,"rows_kept":352,"cut":false,"hidden":false,"merged":[]}
[31,{"$f":"LEFT(VLOOKUP(A1,ActiveFunds!$G$4:$H$150,2,0),3)","v":"104"},null,{"$f":"VLOOKUP(A1,ActiveFunds!$G$4:$H$150,2,0)","v":"104-Economic & Revenue Forecast Council"},null,"Central Service Fund Splits"]
[null,"DuplicateCheck"]
[]
[null,null,null,null,null,null,null,null,{"$f":"IF(AND(LEFT(F10,3)=\"300\",LEFT(G10,3)=\"030\"),$Y$5:$Y$8,IF(AND(LEFT(F10,3)=\"300\",LEFT(G10,3)=\"040\"),$Y$9:$Y$11,\"\"))","v":""}]
[]
[{"$f":"LEFT(F6,3)","v":""},{"$f":"TRIM(LEFT(G6,3))","v":""},{"$f":"TRIM(LEFT(H6,4))","v":""},{"$f":"LEFT(I6,3)","v":""},{"$f":"MID(I6,5,1)","v":""},{"$f":"IF(AgyChoice = 1,\"When all agencies are selected you will not be able to edit the worksheet\",\"\")","v":""},null,{"$f":"IF(AND(LEFT(F10,3)=\"300\",LEFT(G10,3)=\"030\"),ActiveFunds!$Z$5:$Z$8,IF(AND(LEFT(F10,3)=\"300\",LEFT(G106,3)=\"040\"),ActiveFunds!$Z$9:$Z$12,\"\"))","v":""},null,"All Columns by Agency must equal 100%"]
["Agency Code","Program Code","Subprogram Code","Account","AppType","Agency","Program","Subprogram (only used for DSHS in Program 030 and 040)","Account and Approp Title","Auditor","AttGen","OAH","Facilities & Services Only","CTS","Debt Services ","Workers' Comp","All Other","Risk Mgmt Division","Self Insurance"]
[null,null,null,null,null,"Percent Totals (only applies when one agency chosen)",null,null,null,{"$f":"IF(AgyChoice=1,\"\",SUM(J9:J984))","v":1},1,1,1,1,1,1,1,1,1]
["Agency Code","Program Code","SubprogramCode","Account","AppType","Agency","Program","Subprogram (only used for DSHS in Program 030 and 040)","Account and Approp Title","Auditor","AttGen","OAH","Facilities & Services Only","CTS","Debt Services ","Workers' Comp","All Other","Risk Mgmt Division","Self Insurance"]
["104","","","001","1","104-Economic & Revenue Forecast Council",null,null,"001-1 General Fund-State",1,1,1,1,1,1,1,1,1,1,null,null,0,64.999999999999986,null,null,null,null,null,null,null,null,null,null,null,null,0]
[null,null,null,null,null,null,null,null,null,null,null,null,null,null,null,null,null,null,null,null,null,null,null,null,null,null,null,null,null,null,null,null,null,null,null,0]
[null,null,null,null,null,null,null,null,null,null,null,null,null,null,null,null,null,null,null,null,null,null,null,null,null,null,null,null,null,null,null,null,null,null,null,1]
[null,null,null,null,null,null,null,null,null,null,null,null,null,null,null,null,null,null,null,null,null,null,null,null,null,null,null,null,null,null,null,null,null,null,null,0]
[null,null,null,null,null,null,null,null,null,null,null,null,null,null,null,null,null,null,null,null,null,null,null,null,null,null,null,null,null,null,null,null,null,null,null,0]
[null,null,null,null,null,null,null,null,null,null,null,null,null,null,null,null,null,null,null,null,null,null,null,null,null,null,null,null,null,null,null,null,null,null,null,0]
[null,null,null,null,null,null,null,null,null,null,null,null,null,null,null,null,null,null,null,null,null,null,null,null,null,null,null,null,null,null,null,null,null,null,null,0]
[null,null,null,null,null,null,null,null,null,null,null,null,null,null,null,null,null,null,null,null,null,null,null,null,null,null,null,null,null,null,null,null,null,null,null,0]
[null,null,null,null,null,null,null,null,null,null,null,null,null,null,null,null,null,null,null,null,null,null,null,null,null,null,null,null,null,null,null,null,null,null,null,0]
[null,null,null,null,null,null,null,null,null,null,null,null,null,null,null,null,null,null,null,null,null,null,null,null,null,null,null,null,null,null,null,null,null,null,null,0]
[null,null,null,null,null,null,null,null,null,null,null,null,null,null,null,null,null,null,null,null,null,null,null,null,null,null,null,null,null,null,null,null,null,null,null,0]
{"$rows_left_out":333}
{"sheet":"FundSplitsDB","index":2,"n_rows":341,"n_cols":36,"rows_kept":341,"cut":false,"hidden":true,"merged":[]}
["Agency Code","Program Code","SubprogramCode","Account","AppType","Agency","Program","Subprogram (only used for DSHS in Program 030 and 040)","Account and Approp Title",{"$f":"IF(FundSplits!J7=\"\",\"\",FundSplits!J7)","v":"Auditor"},{"$f":"IF(FundSplits!K7=\"\",\"\",FundSplits!K7)","v":"AttGen"},{"$f":"IF(FundSplits!L7=\"\",\"\",FundSplits!L7)","v":"OAH"},{"$f":"IF(FundSplits!M7=\"\",\"\",FundSplits!M7)","v":"Facilities & Services Only"},{"$f":"IF(FundSplits!N7=\"\",\"\",FundSplits!N7)","v":"CTS"},{"$f":"IF(FundSplits!O7=\"\",\"\",FundSplits!O7)","v":"Debt Services "},{"$f":"IF(FundSplits!P7=\"\",\"\",FundSplits!P7)","v":"Workers' Comp"},{"$f":"IF(FundSplits!Q7=\"\",\"\",FundSplits!Q7)","v":"All Other"},"Risk Mgmt Division","Self Insurance",{"$f":"IF(FundSplits!T7=\"\",\"\",FundSplits!T7)","v":""},{"$f":"IF(FundSplits!U7=\"\",\"\",FundSplits!U7)","v":""},{"$f":"IF(FundSplits!V7=\"\",\"\",FundSplits!V7)","v":""},{"$f":"IF(FundSplits!W7=\"\",\"\",FundSplits!W7)","v":""},{"$f":"IF(FundSplits!X7=\"\",\"\",FundSplits!X7)","v":""},{"$f":"IF(FundSplits!Y7=\"\",\"\",FundSplits!Y7)","v":""},{"$f":"IF(FundSplits!Z7=\"\",\"\",FundSplits!Z7)","v":""},{"$f":"IF(FundSplits!AA7=\"\",\"\",FundSplits!AA7)","v":""},{"$f":"IF(FundSplits!AB7=\"\",\"\",FundSplits!AB7)","v":""},{"$f":"IF(FundSplits!AC7=\"\",\"\",FundSplits!AC7)","v":""},{"$f":"IF(FundSplits!AD7=\"\",\"\",FundSplits!AD7)","v":""},{"$f":"IF(FundSplits!AE7=\"\",\"\",FundSplits!AE7)","v":""},null,"Check Agency has Fund Splits",{"$f":"COUNTIF(A:A,AgyCode)","v":1}]
[{"$f":"LEFT(F2,3)","v":"011"},{"$f":"IF(G2=\"\",\"\",LEFT(G2,3))","v":""},{"$f":"IF(H2=\"\",\"\",LEFT(H2,4))","v":""},{"$f":"LEFT(I2,3)","v":"001"},{"$f":"MID(I2,5,1)","v":"1"},"011-House of Representatives",null,null,"001-1 General Fund-State",1,1,1,1,1,1,1,1,1,1,null,null,{"$f":"SUMPRODUCT(--(FundSplits!$D$2:$D$335=\"001\"),--(FundSplits!$E$2:$E$335=\"1\"),FundSplits!$J$2:$J$335)","v":1},{"$f":"SUM(J2:J198)","v":64.999999999999986},null,null,null,null,null,null,null,null,null,null,null,null,{"$f":"VLOOKUP(A2&D2&\"-\"&E2,ActiveFunds!$AH$4:$AI$787,2,0)","v":0}]
["012","","","001","1","012-Senate",null,null,"001-1 General Fund-State",1,1,1,1,1,1,1,1,1,1,null,null,null,null,null,null,null,null,null,null,null,null,null,null,null,null,{"$f":"VLOOKUP(A3&D3&\"-\"&E3,ActiveFunds!$AH$4:$AI$787,2,0)","v":0}]
["013","","","108","1","013-Joint Transportation Committee",null,null,"108-1 Motor Vehicle Account-State",1,1,1,1,1,1,1,1,1,1,null,null,null,null,null,null,null,null,null,null,null,null,null,null,null,null,{"$f":"VLOOKUP(A4&D4&\"-\"&E4,ActiveFunds!$AH$4:$AI$787,2,0)","v":1}]
["014","","","553","1","014-Jt Leg Audit & Review Committee",null,null,"553-1 Performance Audits of Govt Acct-State",1,1,1,1,1,1,1,1,1,1,null,null,null,null,null,null,null,null,null,null,null,null,null,null,null,null,{"$f":"VLOOKUP(A5&D5&\"-\"&E5,ActiveFunds!$AH$4:$AI$787,2,0)","v":0}]
["020","","","553","1","020-LEAP Committee",null,null,"553-1 Performance Audits of Govt Acct-State",1,1,1,1,1,1,1,1,1,1,null,null,null,null,null,null,null,null,null,null,null,null,null,null,null,null,{"$f":"VLOOKUP(A6&D6&\"-\"&E6,ActiveFunds!$AH$4:$AI$787,2,0)","v":0}]
["035","","","600","1","035-Office of the State Actuary",null,null,"600-1 Dept of Retirement Systems Expense-State",1,1,1,1,1,1,1,1,1,1,null,null,null,null,null,null,null,null,null,null,null,null,null,null,null,null,{"$f":"VLOOKUP(A7&D7&\"-\"&E7,ActiveFunds!$AH$4:$AI$787,2,0)","v":0}]
["037","","","001","1","037-Office of Legislative Support Svcs",null,null,"001-1 General Fund-State",1,1,1,1,1,1,1,1,1,1,null,null,null,null,null,null,null,null,null,null,null,null,null,null,null,null,{"$f":"VLOOKUP(A8&D8&\"-\"&E8,ActiveFunds!$AH$4:$AI$787,2,0)","v":0}]
["038","","","001","1","038-Joint Legislative Systems Comm",null,null,"001-1 General Fund-State",1,1,1,1,1,1,1,1,1,1,null,null,null,null,null,null,null,null,null,null,null,null,null,null,null,null,{"$f":"VLOOKUP(A9&D9&\"-\"&E9,ActiveFunds!$AH$4:$AI$787,2,0)","v":0}]
["040","","","001","1","040-Statute Law Committee",null,null,"001-1 General Fund-State",0.8,0.8,0.8,0.8,0.8,0.8,0.8,0.8,0.8,0.8,null,null,null,null,null,null,null,null,null,null,null,null,null,null,null,null,{"$f":"VLOOKUP(A10&D10&\"-\"&E10,ActiveFunds!$AH$4:$AI$787,2,0)","v":0}]
["040","","","197","6","040-Statute Law Committee",null,null,"197-6 Statute Law Committee Publications-Non-Appropriated",0.2,0.2,0.2,0.2,0.2,0.2,0.2,0.2,0.2,0.2,null,null,null,null,null,null,null,null,null,null,null,null,null,null,null,null,{"$f":"VLOOKUP(A11&D11&\"-\"&E11,ActiveFunds!$AH$4:$AI$787,2,0)","v":0}]
["045","","","001","1","045-Supreme Court",null,null,"001-1 General Fund-State",1,1,1,1,1,1,1,1,1,1,null,null,null,null,null,null,null,null,null,null,null,null,null,null,null,null,{"$f":"VLOOKUP(A12&D12&\"-\"&E12,ActiveFunds!$AH$4:$AI$787,2,0)","v":0}]
["046","","","001","1","046-State Law Library",null,null,"001-1 General Fund-State",1,1,1,1,1,1,1,1,1,1,null,null,null,null,null,null,null,null,null,null,null,null,null,null,null,null,{"$f":"VLOOKUP(A13&D13&\"-\"&E13,ActiveFunds!$AH$4:$AI$787,2,0)","v":0}]
["048","","","001","1","048-Court of Appeals",null,null,"001-1 General Fund-State",1,1,1,1,1,1,1,1,1,1,null,null,null,null,null,null,null,null,null,null,null,null,null,null,null,null,{"$f":"VLOOKUP(A14&D14&\"-\"&E14,ActiveFunds!$AH$4:$AI$787,2,0)","v":0}]
["050","","","001","1","050-Commission on Judicial Conduct",null,null,"001-1 General Fund-State",1,1,1,1,1,1,1,1,1,1,null,null,null,null,null,null,null,null,null,null,null,null,null,null,null,null,{"$f":"VLOOKUP(A15&D15&\"-\"&E15,ActiveFunds!$AH$4:$AI$787,2,0)","v":0}]
["055","","","001","1","055-Administrative Office of the Courts",null,null,"001-1 General Fund-State",1,1,1,1,1,1,1,1,1,1,null,null,null,null,null,null,null,null,null,null,null,null,null,null,null,null,{"$f":"VLOOKUP(A16&D16&\"-\"&E16,ActiveFunds!$AH$4:$AI$787,2,0)","v":0}]
["056","","","16A","1","056-Office of Public Defense",null,null,"16A-1 Judicial Stabilization Trust Accoun-State",1,1,1,1,1,1,1,1,1,1,null,null,null,null,null,null,null,null,null,null,null,null,null,null,null,null,{"$f":"VLOOKUP(A17&D17&\"-\"&E17,ActiveFunds!$AH$4:$AI$787,2,0)","v":0}]
["057","","","001","1","057-Office of Civil Legal Aid",null,null,"001-1 General Fund-State",1,1,1,1,1,1,1,1,1,1,null,null,null,null,null,null,null,null,null,null,null,null,null,null,null,null,{"$f":"VLOOKUP(A18&D18&\"-\"&E18,ActiveFunds!$AH$4:$AI$787,2,0)","v":0}]
["075","","","001","1","075-Office of the Governor",null,null,"001-1 General Fund-State",1,1,1,1,1,1,1,1,1,1,null,null,null,null,null,null,null,null,null,null,null,null,null,null,null,null,{"$f":"VLOOKUP(A19&D19&\"-\"&E19,ActiveFunds!$AH$4:$AI$787,2,0)","v":0}]
["080","","","001","1","080-Office of the Lieutenant Governor",null,null,"001-1 General Fund-State",1,1,1,1,1,1,1,1,1,1,null,null,null,null,null,null,null,null,null,null,null,null,null,null,null,null,{"$f":"VLOOKUP(A20&D20&\"-\"&E20,ActiveFunds!$AH$4:$AI$787,2,0)","v":0}]
{"$rows_left_out":322}
{"sheet":"ActiveFunds","index":3,"n_rows":893,"n_cols":43,"rows_kept":893,"cut":false,"hidden":true,"merged":[]}
[null,null,null,"001-1",null,null,null,"001-2 General Fund-Federal",null,{"$f":"COUNTIF(AgencyFund,Agency)","v":2},null,null,"",{"$f":"IF(pgmcheck=1,OFFSET(AgencyProgram,MATCH((AgyCode),AgencyProgram,0)-1,4,COUNTIF(AgencyProgram,AgyCode)),PgmList)","v":{"$error":"#VALUE!"}},null,null,null,"IF(AgyChoice=1,FundList,OFFSET(AgencyFund,MATCH((Agency),AgencyFund,0)-1,1,COUNTIF(AgencyFund,Agency)))"]
[null,"AgencyFund Table",null,null,null,null,null,null,null,null,"Distinct Fund List",null,null,"Programcheck",null,{"$f":"IFERROR(INDEX($M$4:$M$67,MATCH(AgyCode,ActiveFunds!$N$4:$N$72,0)),0)","v":0},null,{"$f":"IF(pgmcheck=1,OFFSET(AgencyProgram,MATCH((AgyCode),AgencyProgram,0)-1,4,COUNTIF(AgencyProgram,AgyCode)),OFFSET(pgmcheck,0,1))","v":0},{"$f":"IF(pgmcheck=1,OFFSET(AgencyProgram,MATCH((AgyCode),AgencyProgram,0)-1,4,COUNTIF(AgencyProgram,AgyCode)),PgmList)","v":{"$error":"#VALUE!"}},null,null,null,null,"IF(pgmcheck=1,OFFSET(AgencyProgram,MATCH((AgyCode),AgencyProgram,0)-1,4,COUNTIF(AgencyProgram,AgyCode)),$A$2)"]
[null,"Agency","Fund","Column1",null,null,null,"Agency",null,null,"Fund",null,null,"Agency","ProgramCode","BudgetType","SummFlag","ProgramTitle60","Program2",null,null,null,null,null,null,null,null,null,null,null,null,null,null,null,null,null,null,"NGFS & Totals",null,"FY's & Biennial Totals",null,null,"M"]
[null,"011-House of Representatives","001-1 General Fund-State",{"$f":"LEFT(ActiveFunds!$C4,5)","v":"001-1"},{"$f":"IFERROR(IF(VLOOKUP(D4,$AH$5:$AI$786,2,0)=\"O\",0,IF(VLOOKUP(D4,#REF!,2,0)=\"T\",1,0)),\"ERROR\")","v":"ERROR"},"All",1,"All Agencies",{"$f":"LEFT(H4,3)","v":"All"},{"$f":"MID(K4,1,5)","v":"001-1"},"001-1 General Fund-State",null,1,"107","HBE","O",false,"Health Care Auth-Health Benefit Exchange",{"$f":"ActiveFunds!$O4&\"-\"&ActiveFunds!$R4","v":"HBE-Health Care Auth-Health Benefit Exchange"},null,{"$f":"N4&O4","v":"107HBE"},{"$f":"O4&\"-\"&R4","v":"HBE-Health Care Auth-Health Benefit Exchange"},null,"Agency","Program","Subprogram","AgencyProgram",null,null,null,null,"Agy","Fund","AgyFund","Flag",null,null,"Totals Only",null,"Biennial Totals Only",null,null,"P"]
[null,"011-House of Representatives","108-1 Motor Vehicle Account-State",{"$f":"LEFT(ActiveFunds!$C5,5)","v":"108-1"},{"$f":"IFERROR(IF(VLOOKUP(D5,#REF!,2,0)=\"O\",0,IF(VLOOKUP(D5,#REF!,2,0)=\"T\",1,0)),\"ERROR\")","v":"ERROR"},"011",2,"011-House of Representatives","011",{"$f":"MID(K5,1,5)","v":"001-2"},"001-2 General Fund-Federal",null,1,"107","OTH","O",false,"Health Care Auth-Other",{"$f":"ActiveFunds!$O5&\"-\"&ActiveFunds!$R5","v":"OTH-Health Care Auth-Other"},null,{"$f":"N5&O5","v":"107OTH"},{"$f":"O5&\"-\"&R5","v":"OTH-Health Care Auth-Other"},null,"300","030","1000-Community Services/RSN             ","300030",null,null,null,null,"010","001-1",{"$f":"AF5&AG5","v":"010001-1"},0,null,null,"NGFS Only",null,"FY's Only",null,null,"C"]
[null,"011-House of Representatives","442-6 Legislative Gift Center Account-Non-Appropriated",{"$f":"LEFT(ActiveFunds!$C6,5)","v":"442-6"},{"$f":"IFERROR(IF(VLOOKUP(D6,#REF!,2,0)=\"O\",0,IF(VLOOKUP(D6,#REF!,2,0)=\"T\",1,0)),\"ERROR\")","v":"ERROR"},"012",3,"012-Senate","012","001-3","001-3 General Fund-Federal Unanticipated",null,1,"107","PEB","O",false,"Health Care Auth-Employee Benefits",{"$f":"ActiveFunds!$O6&\"-\"&ActiveFunds!$R6","v":"PEB-Health Care Auth-Employee Benefits"},null,"107PEB","PEB-Health Care Auth-Employee Benefits",null,"300","030","2000-State Facility Services            ","300030",null,null,null,null,"010","057-1",{"$f":"AF6&AG6","v":"010057-1"},0]
[null,"012-Senate","001-1 General Fund-State",{"$f":"LEFT(ActiveFunds!$C7,5)","v":"001-1"},{"$f":"IFERROR(IF(VLOOKUP(D7,#REF!,2,0)=\"O\",0,IF(VLOOKUP(D7,#REF!,2,0)=\"T\",1,0)),\"ERROR\")","v":"ERROR"},"013",4,"013-Joint Transportation Committee","013","001-7","001-7 General Fund-Private/Local",null,1,"107","SEB","O",false,"School Employee Benefits Board",{"$f":"ActiveFunds!$O7&\"-\"&ActiveFunds!$R7","v":"SEB-School Employee Benefits Board"},null,"107SEB","SEB-School Employee Benefits Board",null,"300","030","8000-Special Projects                   ","300030",null,null,null,null,"010","10P-1","01010P-1",0]
[null,"012-Senate","108-1 Motor Vehicle Account-State",{"$f":"LEFT(ActiveFunds!$C8,5)","v":"108-1"},{"$f":"IFERROR(IF(VLOOKUP(D8,#REF!,2,0)=\"O\",0,IF(VLOOKUP(D8,#REF!,2,0)=\"T\",1,0)),\"ERROR\")","v":"ERROR"},"014",5,"014-Jt Leg Audit & Review Committee","014","001-8","001-8 General Fund-Federal ARRA",null,1,"300","010","O",false,"Children & Family Services",{"$f":"ActiveFunds!$O8&\"-\"&ActiveFunds!$R8","v":"010-Children & Family Services"},null,"300010","010-Children & Family Services",null,"300","030","9000-Program Support                    ","300030",null,null,null,null,"010","10T-1","01010T-1",0]
[null,"013-Joint Transportation Committee","108-1 Motor Vehicle Account-State",{"$f":"LEFT(ActiveFunds!$C9,5)","v":"108-1"},{"$f":"IFERROR(IF(VLOOKUP(D9,#REF!,2,0)=\"O\",0,IF(VLOOKUP(D9,#REF!,2,0)=\"T\",1,0)),\"ERROR\")","v":"ERROR"},"020",6,"020-LEAP Committee","020","001-9","001-9 General Fund-Private/Local Unanticipated",null,1,"300","020","O",false,"Juvenile Rehabilitation",{"$f":"ActiveFunds!$O9&\"-\"&ActiveFunds!$R9","v":"020-Juvenile Rehabilitation"},null,"300020","020-Juvenile Rehabilitation",null,"300","040","1000-Community Services                 ","300040",null,null,null,null,"010","18B-1","01018B-1",0]
[null,"014-Jt Leg Audit & Review Committee","001-1 General Fund-State",{"$f":"LEFT(ActiveFunds!$C10,5)","v":"001-1"},{"$f":"IFERROR(IF(VLOOKUP(D10,#REF!,2,0)=\"O\",0,IF(VLOOKUP(D10,#REF!,2,0)=\"T\",1,0)),\"ERROR\")","v":"ERROR"},"035",7,"035-Office of the State Actuary","035","002-1","002-1 Hospital Data Collection Account-State",null,1,"300","030","O",true,"Mental Health",{"$f":"ActiveFunds!$O10&\"-\"&ActiveFunds!$R10","v":"030-Mental Health"},null,"300030","030-Mental Health",null,"300","040","2000-Residential Habilitation Services  ","300040",null,null,null,null,"010","355-1","010355-1",0]
[null,"014-Jt Leg Audit & Review Committee","553-1 Performance Audits of Govt Acct-State",{"$f":"LEFT(ActiveFunds!$C11,5)","v":"553-1"},{"$f":"IFERROR(IF(VLOOKUP(D11,#REF!,2,0)=\"O\",0,IF(VLOOKUP(D11,#REF!,2,0)=\"T\",1,0)),\"ERROR\")","v":"ERROR"},"037",8,"037-Office of Legislative Support Svcs","037","003-1","003-1 Architects' License Account-State",null,1,"300","040","O",true,"Developmental Disabilities",{"$f":"ActiveFunds!$O11&\"-\"&ActiveFunds!$R11","v":"040-Developmental Disabilities"},null,"300040","040-Developmental Disabilities",null,"300","040","8000-Special Projects                   ","300040",null,null,null,null,"010","357-1","010357-1",0]
[null,"020-LEAP Committee","108-1 Motor Vehicle Account-State",{"$f":"LEFT(ActiveFunds!$C12,5)","v":"108-1"},{"$f":"IFERROR(IF(VLOOKUP(D12,#REF!,2,0)=\"O\",0,IF(VLOOKUP(D12,#REF!,2,0)=\"T\",1,0)),\"ERROR\")","v":"ERROR"},"038",9,"038-Joint Legislative Systems Comm","038","006-1","006-1 Public Records Effic/Presrv/Access-State",null,1,"300","050","O",false,"Long-Term Care Services",{"$f":"ActiveFunds!$O12&\"-\"&ActiveFunds!$R12","v":"050-Long-Term Care Services"},null,"300050","050-Long-Term Care Services",null,"300","040","9000-Program Support                    ","300040",null,null,null,null,"010","381-1","010381-1",0]
[null,"020-LEAP Committee","553-1 Performance Audits of Govt Acct-State",{"$f":"LEFT(ActiveFunds!$C13,5)","v":"553-1"},{"$f":"IFERROR(IF(VLOOKUP(D13,#REF!,2,0)=\"O\",0,IF(VLOOKUP(D13,#REF!,2,0)=\"T\",1,0)),\"ERROR\")","v":"ERROR"},"040",10,"040-Statute Law Committee","040","007-1","007-1 Winter Recreation Program Account-State",null,1,"300","060","O",false,"Economic Services Administration",{"$f":"ActiveFunds!$O13&\"-\"&ActiveFunds!$R13","v":"060-Economic Services Administration"},null,"300060","060-Economic Services Administration",null,null,null,null,null,null,null,null,null,"010","383-1","010383-1",0]
[null,"035-Office of the State Actuary","001-1 General Fund-State",{"$f":"LEFT(ActiveFunds!$C14,5)","v":"001-1"},{"$f":"IFERROR(IF(VLOOKUP(D14,#REF!,2,0)=\"O\",0,IF(VLOOKUP(D14,#REF!,2,0)=\"T\",1,0)),\"ERROR\")","v":"ERROR"},"045",11,"045-Supreme Court","045","014-1","014-1 Forest Development Account-State",null,1,"300","070","O",false,"Alcohol & Substance Abuse",{"$f":"ActiveFunds!$O14&\"-\"&ActiveFunds!$R14","v":"070-Alcohol & Substance Abuse"},null,"300070","070-Alcohol & Substance Abuse",null,null,null,null,null,null,null,null,null,"010","608-1","010608-1",0]
[null,"035-Office of the State Actuary","418-1 St Health Care Authority Admin Acct-State",{"$f":"LEFT(ActiveFunds!$C15,5)","v":"418-1"},{"$f":"IFERROR(IF(VLOOKUP(D15,#REF!,2,0)=\"O\",0,IF(VLOOKUP(D15,#REF!,2,0)=\"T\",1,0)),\"ERROR\")","v":"ERROR"},"046",12,"046-State Law Library","046","01B-1","01B-1 ORV & Non-Highway Vehicle Account-State",null,1,"300","100","O",false,"Vocational Rehabilitation",{"$f":"ActiveFunds!$O15&\"-\"&ActiveFunds!$R15","v":"100-Vocational Rehabilitation"},null,"300100","100-Vocational Rehabilitation",null,"9000-Program Support                    ",null,null,null,null,null,null,null,"010","609-1","010609-1",0]
[null,"035-Office of the State Actuary","600-1 Dept of Retirement Systems Expense-State",{"$f":"LEFT(ActiveFunds!$C16,5)","v":"600-1"},{"$f":"IFERROR(IF(VLOOKUP(D16,#REF!,2,0)=\"O\",0,IF(VLOOKUP(D16,#REF!,2,0)=\"T\",1,0)),\"ERROR\")","v":"ERROR"},"048",13,"048-Court of Appeals","048","01F-6","01F-6 Crime Victims Compensation Account-Non-Appropriated",null,1,"300","110","O",false,"Administration & Supporting Services",{"$f":"ActiveFunds!$O16&\"-\"&ActiveFunds!$R16","v":"110-Administration & Supporting Services"},null,"300110","110-Administration & Supporting Services",null,"2000-State Facility Services            ",null,null,null,null,null,null,null,"011","001-1","011001-1",0]
[null,"037-Office of Legislative Support Svcs","001-1 General Fund-State",{"$f":"LEFT(ActiveFunds!$C17,5)","v":"001-1"},{"$f":"IFERROR(IF(VLOOKUP(D17,#REF!,2,0)=\"O\",0,IF(VLOOKUP(D17,#REF!,2,0)=\"T\",1,0)),\"ERROR\")","v":"ERROR"},"050",14,"050-Commission on Judicial Conduct","050","01M-1","01M-1 Snowmobile Account-State",null,1,"300","135","O",false,"Special Commitment Center",{"$f":"ActiveFunds!$O17&\"-\"&ActiveFunds!$R17","v":"135-Special Commitment Center"},null,"300135","135-Special Commitment Center",null,"1000-Community Services/RSN             ",null,null,null,null,null,null,null,"011","108-1","011108-1",0]
[null,"037-Office of Legislative Support Svcs","14N-6 Legislative Oral History Account-Non-Appropriated",{"$f":"LEFT(ActiveFunds!$C18,5)","v":"14N-6"},{"$f":"IFERROR(IF(VLOOKUP(D18,#REF!,2,0)=\"O\",0,IF(VLOOKUP(D18,#REF!,2,0)=\"T\",1,0)),\"ERROR\")","v":"ERROR"},"055",15,"055-Administrative Office of the Courts","055","024-1","024-1 Professional Engineers' Account-State",null,1,"300","145","O",false,"Payments to Other Agencies",{"$f":"ActiveFunds!$O18&\"-\"&ActiveFunds!$R18","v":"145-Payments to Other Agencies"},null,"300145","145-Payments to Other Agencies",null,"2000-State Facility Services            ",null,null,null,null,null,null,null,"012","001-1","012001-1",0]
[null,"037-Office of Legislative Support Svcs","442-6 Legislative Gift Center Account-Non-Appropriated",{"$f":"LEFT(ActiveFunds!$C19,5)","v":"442-6"},{"$f":"IFERROR(IF(VLOOKUP(D19,#REF!,2,0)=\"O\",0,IF(VLOOKUP(D19,#REF!,2,0)=\"T\",1,0)),\"ERROR\")","v":"ERROR"},"056",16,"056-Office of Public Defense","056","025-6","025-6 Pilotage Account-Non-Appropriated",null,1,"300","150","O",false,"Information System Services",{"$f":"ActiveFunds!$O19&\"-\"&ActiveFunds!$R19","v":"150-Information System Services"},null,"300150","150-Information System Services",null,"9000-Program Support                    ",null,null,null,null,null,null,null,"012","108-1","012108-1",0]
[null,"038-Joint Legislative Systems Comm","001-1 General Fund-State",{"$f":"LEFT(ActiveFunds!$C20,5)","v":"001-1"},{"$f":"IFERROR(IF(VLOOKUP(D20,#REF!,2,0)=\"O\",0,IF(VLOOKUP(D20,#REF!,2,0)=\"T\",1,0)),\"ERROR\")","v":"ERROR"},"057",17,"057-Office of Civil Legal Aid","057","026-1","026-1 Real Estate Commission Account-State",null,1,"300","160","O",false,"Consolidated Field Services",{"$f":"ActiveFunds!$O20&\"-\"&ActiveFunds!$R20","v":"160-Consolidated Field Services"},null,"300160","160-Consolidated Field Services",null,null,null,null,null,null,null,null,null,"014","001-1","014001-1",0]
{"$rows_left_out":873}